Build #167

Build: #167 failed Child of CDAP-DRC-3420

Build result summary

Details

Completed
Duration
117 minutes
Labels
None
Agent
bamboo-agent12
Revision
96f69d167701be6e36635d015a8d592a66bf68ef 96f69d167701be6e36635d015a8d592a66bf68ef
Total tests
1973
Fixed in
#170 (Child of CDAP-DRC-3427)

Responsible

Code commits

Author Commit Message Commit date
Tony Bach Tony Bach 96f69d167701be6e36635d015a8d592a66bf68ef 96f69d167701be6e36635d015a8d592a66bf68ef Merge pull request #9210 from caskdata/feature/ui-pipeline-nodes-new-look
[CDAP-12057] Pipeline Studio - Node redesign
Tony Bach Tony Bach 32c328a59048d0fdd304903fd7359a531f46cbb6 32c328a59048d0fdd304903fd7359a531f46cbb6 [CDAP-12057] Pipeline Studio - Node redesign - Implements new node look - Removes close button, and adds menu with Delete action - Fixes bug where nodes were not draggable until canvas is dragged or a node is opened - Fixes bug where the Configure Properties btn has to be clicked twice after a node is dragged - Fixes bug where nodes were not showing up in draft of imported pipeline after saving - Modifies fitToScreen and getGraphMargins algos to accomodate new node width and height - Reduces number of letters necessary to show ellipses in new node design
Terence Yim Terence Yim c239a5211c92a73b852b6bb490e6742592632cbc c239a5211c92a73b852b6bb490e6742592632cbc Merge branch 'release/4.2' into develop
Derek Wood Derek Wood 4654af6cbc421286ba218dd023598898e88243a7 m 4654af6cbc421286ba218dd023598898e88243a7 Merge pull request #9221 from caskdata/feature/cherry-pick-gh9213-rel-42
pin eclipse m2e to release version
Bhooshan Mogal Bhooshan Mogal 9145c631a2dd237132d0985d7a57830e2e870d34 m 9145c631a2dd237132d0985d7a57830e2e870d34 Merge pull request #9220 from caskdata/fix-version
fix dataprep version

Tests

New test failures 3
Status Test View job Duration
Collapse Failed HBaseMessageTableTestRun testConcurrentWrites History
Unit Test Job 5 secs
java.lang.AssertionError
	at org.junit.Assert.fail(Assert.java:86)
	at org.junit.Assert.assertTrue(Assert.java:41)
	at org.junit.Assert.assertTrue(Assert.java:52)
	at co.cask.cdap.messaging.store.MessageTableTest.testConcurrentWrites(MessageTableTest.java:294)
	at sun.reflect.NativeMethodAccessorImpl.invoke0(Native Method)
	at sun.reflect.NativeMethodAccessorImpl.invoke(NativeMethodAccessorImpl.java:57)
	at sun.reflect.DelegatingMethodAccessorImpl.invoke(DelegatingMethodAccessorImpl.java:43)
(52 more lines...)
Collapse Failed AuthorizationTest testScheduleAuth History
Unit Test Job 10 secs
co.cask.cdap.common.NamespaceCannotBeDeletedException: 'namespace:authorization' could not be deleted. Reason: 'namespace:authorization' could not be deleted. Reason: The following programs are still running: AppWithSchedule: SampleWorkflow
	at co.cask.cdap.internal.app.namespace.DefaultNamespaceAdmin.delete(DefaultNamespaceAdmin.java:335)
	at co.cask.cdap.security.AuthorizationTest.cleanupTest(AuthorizationTest.java:1243)
	at sun.reflect.NativeMethodAccessorImpl.invoke0(Native Method)
	at sun.reflect.NativeMethodAccessorImpl.invoke(NativeMethodAccessorImpl.java:57)
	at sun.reflect.DelegatingMethodAccessorImpl.invoke(DelegatingMethodAccessorImpl.java:43)
	at java.lang.reflect.Method.invoke(Method.java:606)
	at org.junit.runners.model.FrameworkMethod$1.runReflectiveCall(FrameworkMethod.java:47)
(49 more lines...)
Collapse Failed AuthorizationTest testApps History
Unit Test Job < 1 sec
java.lang.AssertionError: expected:<[]> but was:<[Privilege{entity=application:authorization.AppWithSchedule.-SNAPSHOT, action=WRITE}, Privilege{entity=artifact:authorization.AppWithSchedule.1.0-SNAPSHOT, action=EXECUTE}, Privilege{entity=dataset:authorization.output, action=WRITE}, Privilege{entity=application:authorization.AppWithSchedule.-SNAPSHOT, action=READ}, Privilege{entity=namespace:authorization, action=ADMIN}, Privilege{entity=dataset:authorization.output, action=READ}, Privilege{entity=dataset:authorization.output, action=ADMIN}, Privilege{entity=instance:cdap, action=ADMIN}, Privilege{entity=namespace:authorization, action=EXECUTE}, Privilege{entity=dataset:authorization.input, action=ADMIN}, Privilege{entity=dataset:authorization.input, action=READ}, Privilege{entity=program:authorization.AppWithSchedule.-SNAPSHOT.workflow.SampleWorkflow, action=EXECUTE}, Privilege{entity=namespace:authorization, action=READ}, Privilege{entity=program:authorization.AppWithSchedule.-SNAPSHOT.workflow.SampleWorkflow, action=ADMIN}, Privilege{entity=application:authorization.AppWithSchedule.-SNAPSHOT, action=EXECUTE}, Privilege{entity=program:authorization.AppWithSchedule.-SNAPSHOT.workflow.SampleWorkflow, action=WRITE}, Privilege{entity=dataset:authorization.input, action=WRITE}, Privilege{entity=artifact:authorization.AppWithSchedule.1.0-SNAPSHOT, action=WRITE}, Privilege{entity=dataset:authorization.output, action=EXECUTE}, Privilege{entity=namespace:authorization, action=WRITE}, Privilege{entity=dataset:authorization.input, action=EXECUTE}, Privilege{entity=program:authorization.AppWithSchedule.-SNAPSHOT.workflow.SampleWorkflow, action=READ}, Privilege{entity=application:authorization.AppWithSchedule.-SNAPSHOT, action=ADMIN}, Privilege{entity=artifact:authorization.AppWithSchedule.1.0-SNAPSHOT, action=ADMIN}, Privilege{entity=artifact:authorization.AppWithSchedule.1.0-SNAPSHOT, action=READ}]>
	at org.junit.Assert.fail(Assert.java:88)
	at org.junit.Assert.failNotEquals(Assert.java:743)
	at org.junit.Assert.assertEquals(Assert.java:118)
	at org.junit.Assert.assertEquals(Assert.java:144)
	at co.cask.cdap.security.AuthorizationTest.setupTest(AuthorizationTest.java:177)
	at sun.reflect.NativeMethodAccessorImpl.invoke0(Native Method)
	at sun.reflect.NativeMethodAccessorImpl.invoke(NativeMethodAccessorImpl.java:57)
(48 more lines...)

JIRA issues

IssueDescriptionStatus
15 more issues…
Unknown Issue TypeCDAP-6329Could not obtain issue details from JIRA
Unknown Issue TypeCDAP-9090Could not obtain issue details from JIRA
Unknown Issue TypeCDAP-9323Could not obtain issue details from JIRA
Unknown Issue TypeCDAP-11618Could not obtain issue details from JIRA
Unknown Issue TypeCDAP-11621Could not obtain issue details from JIRA