Build #1,348

Build: #1348 failed Child of CDAP-DRC-5238

Test results

  • 2,907 tests in total
  • 4 tests failed
  • 4 failures are new
  • 17 tests were quarantined / skipped
  • 128 minutes taken in total.
New test failures 4
Status Test View job Duration
Collapse Failed PreviewDataPipelineTest testPreviewStop History
Unit Test Job 5 mins
java.util.concurrent.TimeoutException: Timeout occurred. Expected KILLED but found COMPLETED.
	at io.cdap.cdap.common.utils.Tasks.waitFor(Tasks.java:70)
	at io.cdap.cdap.common.utils.Tasks.waitFor(Tasks.java:91)
	at io.cdap.cdap.common.utils.Tasks.waitFor(Tasks.java:130)
	at io.cdap.cdap.datapipeline.preview.PreviewDataPipelineTest.testDataPipelinePreviewStop(PreviewDataPipelineTest.java:342)
	at io.cdap.cdap.datapipeline.preview.PreviewDataPipelineTest.testPreviewStop(PreviewDataPipelineTest.java:283)
	at sun.reflect.NativeMethodAccessorImpl.invoke0(Native Method)
	at sun.reflect.NativeMethodAccessorImpl.invoke(NativeMethodAccessorImpl.java:62)
(40 more lines...)
Collapse Failed PreviewDataPipelineTest testPreviewFailedRun History
Unit Test Job < 1 sec
io.cdap.cdap.api.dataset.InstanceConflictException: Failed to add instance singleInput due to conflict, details: Response code: 409, message: 'Conflict', body: ''dataset:default.singleInput' already exists'
	at io.cdap.cdap.data2.datafabric.dataset.DatasetServiceClient.addInstance(DatasetServiceClient.java:169)
	at io.cdap.cdap.data2.datafabric.dataset.RemoteDatasetFramework.addInstance(RemoteDatasetFramework.java:147)
	at io.cdap.cdap.data2.dataset2.ForwardingDatasetFramework.addInstance(ForwardingDatasetFramework.java:79)
	at io.cdap.cdap.data2.dataset2.DatasetFramework.addInstance(DatasetFramework.java:140)
	at io.cdap.cdap.test.UnitTestManager.addDatasetInstance(UnitTestManager.java:302)
	at io.cdap.cdap.test.TestBase.addDatasetInstance(TestBase.java:866)
	at io.cdap.cdap.test.TestBase.addDatasetInstance(TestBase.java:881)
(44 more lines...)
Collapse Failed PreviewDataPipelineTest testLogicalTypePreviewRuns History
Unit Test Job < 1 sec
io.cdap.cdap.api.dataset.InstanceConflictException: Failed to add instance singleInput due to conflict, details: Response code: 409, message: 'Conflict', body: ''dataset:default.singleInput' already exists'
	at io.cdap.cdap.data2.datafabric.dataset.DatasetServiceClient.addInstance(DatasetServiceClient.java:169)
	at io.cdap.cdap.data2.datafabric.dataset.RemoteDatasetFramework.addInstance(RemoteDatasetFramework.java:147)
	at io.cdap.cdap.data2.dataset2.ForwardingDatasetFramework.addInstance(ForwardingDatasetFramework.java:79)
	at io.cdap.cdap.data2.dataset2.DatasetFramework.addInstance(DatasetFramework.java:140)
	at io.cdap.cdap.test.UnitTestManager.addDatasetInstance(UnitTestManager.java:302)
	at io.cdap.cdap.test.TestBase.addDatasetInstance(TestBase.java:866)
	at io.cdap.cdap.test.TestBase.addDatasetInstance(TestBase.java:881)
(44 more lines...)
Collapse Failed PreviewDataPipelineTest testDataPipelinePreviewRuns History
Unit Test Job < 1 sec
io.cdap.cdap.api.dataset.InstanceConflictException: Failed to add instance singleInput due to conflict, details: Response code: 409, message: 'Conflict', body: ''dataset:default.singleInput' already exists'
	at io.cdap.cdap.data2.datafabric.dataset.DatasetServiceClient.addInstance(DatasetServiceClient.java:169)
	at io.cdap.cdap.data2.datafabric.dataset.RemoteDatasetFramework.addInstance(RemoteDatasetFramework.java:147)
	at io.cdap.cdap.data2.dataset2.ForwardingDatasetFramework.addInstance(ForwardingDatasetFramework.java:79)
	at io.cdap.cdap.data2.dataset2.DatasetFramework.addInstance(DatasetFramework.java:140)
	at io.cdap.cdap.test.UnitTestManager.addDatasetInstance(UnitTestManager.java:302)
	at io.cdap.cdap.test.TestBase.addDatasetInstance(TestBase.java:866)
	at io.cdap.cdap.test.TestBase.addDatasetInstance(TestBase.java:881)
(44 more lines...)
Skipped tests 17
Status Test Failing since View job
Skipped AltStyleTableRendererTest io.cdap.cdap.cli.util.table.AltStyleTableRendererTest History
Unit Test Job
Skipped CsvTableRendererTest io.cdap.cdap.cli.util.table.CsvTableRendererTest History
Unit Test Job
Skipped SyncTest testSync History
Unit Test Job
Skipped HBaseTableTest testEmptyValuePut History
Unit Test Job
Skipped InMemoryTableTest testEmptyValuePut History
Unit Test Job
Skipped LevelDBTableTest testEmptyValuePut History
Unit Test Job
Skipped ArtifactInspectorTest testInvalidConfigApp History
Unit Test Job
Skipped WorkflowHttpHandlerTest testWorkflowSchedules History
Unit Test Job
Skipped WorkflowHttpHandlerTest testWorkflowForkFailure History
Unit Test Job
Skipped ASMDatumCodecTest testSpeed History
Unit Test Job
Skipped KubeDiscoveryServiceTest io.cdap.cdap.k8s.discovery.KubeDiscoveryServiceTest History
Unit Test Job
Skipped FileMetadataCleanerTest testScanAndDeleteNewMetadata History
Unit Test Job
Skipped PodKillerTaskTest io.cdap.cdap.master.environment.k8s.PodKillerTaskTest History
Unit Test Job
Skipped EntityIdTest printToJson History
Unit Test Job
Skipped EntityIdTest printToString History
Unit Test Job
Skipped ApplicationSecurityTest testAbilityToSetSecurityManagerMultipleTimes History
Unit Test Job
Skipped TestFrameworkTestRun testDeployWorkflowApp History
Unit Test Job