Build #1,346

Build: #1346 failed Child of CDAP-DRC-5236

Test results

  • 2,017 tests in total
  • 3 tests failed
  • 3 failures are new
  • 14 tests were quarantined / skipped
  • 44 minutes taken in total.
New test failures 3
Status Test View job Duration
Collapse Failed CapabilityManagementServiceTest testCapabilityRefresh History
Unit Test Job 2 secs
io.cdap.cdap.common.ArtifactAlreadyExistsException: Artifact artifact:system.App.1.0.0 already exists.
	at io.cdap.cdap.internal.app.runtime.artifact.ArtifactStore.lambda$write$20(ArtifactStore.java:686)
	at io.cdap.cdap.spi.data.nosql.NoSqlTransactionRunner.lambda$run$0(NoSqlTransactionRunner.java:69)
	at io.cdap.cdap.spi.data.nosql.dataset.NoSQLTransactionals$1.finishExecute(NoSQLTransactionals.java:71)
	at io.cdap.cdap.spi.data.nosql.dataset.NoSQLTransactionals$1.execute(NoSQLTransactionals.java:50)
	at io.cdap.cdap.data2.transaction.Transactions$2.executeInternal(Transactions.java:261)
	at io.cdap.cdap.data2.transaction.Transactions$2.execute(Transactions.java:248)
	at io.cdap.cdap.spi.data.nosql.NoSqlTransactionRunner.run(NoSqlTransactionRunner.java:68)
(46 more lines...)
Collapse Failed CapabilityManagementServiceTest testCapabilityRefreshWithSameArtifact History
Unit Test Job 1 min
java.util.concurrent.TimeoutException: Timeout occurred. Expected RUNNING but found null.
	at io.cdap.cdap.common.utils.Tasks.waitFor(Tasks.java:70)
	at io.cdap.cdap.common.utils.Tasks.waitFor(Tasks.java:91)
	at io.cdap.cdap.common.utils.Tasks.waitFor(Tasks.java:130)
	at io.cdap.cdap.internal.app.services.http.AppFabricTestBase.waitState(AppFabricTestBase.java:960)
	at io.cdap.cdap.internal.capability.CapabilityManagementServiceTest.testCapabilityRefreshWithSameArtifact(CapabilityManagementServiceTest.java:363)
	at sun.reflect.NativeMethodAccessorImpl.invoke0(Native Method)
	at sun.reflect.NativeMethodAccessorImpl.invoke(NativeMethodAccessorImpl.java:62)
(36 more lines...)
Collapse Failed CapabilityManagementServiceTest testCapabilityRefreshWithNewArtifact History
Unit Test Job 2 secs
io.cdap.cdap.common.ArtifactAlreadyExistsException: Artifact artifact:system.App.1.0.0 already exists.
	at io.cdap.cdap.internal.app.runtime.artifact.ArtifactStore.lambda$write$20(ArtifactStore.java:686)
	at io.cdap.cdap.spi.data.nosql.NoSqlTransactionRunner.lambda$run$0(NoSqlTransactionRunner.java:69)
	at io.cdap.cdap.spi.data.nosql.dataset.NoSQLTransactionals$1.finishExecute(NoSQLTransactionals.java:71)
	at io.cdap.cdap.spi.data.nosql.dataset.NoSQLTransactionals$1.execute(NoSQLTransactionals.java:50)
	at io.cdap.cdap.data2.transaction.Transactions$2.executeInternal(Transactions.java:261)
	at io.cdap.cdap.data2.transaction.Transactions$2.execute(Transactions.java:248)
	at io.cdap.cdap.spi.data.nosql.NoSqlTransactionRunner.run(NoSqlTransactionRunner.java:68)
(46 more lines...)
Skipped tests 14
Status Test Failing since View job
Skipped AltStyleTableRendererTest io.cdap.cdap.cli.util.table.AltStyleTableRendererTest History
Unit Test Job
Skipped CsvTableRendererTest io.cdap.cdap.cli.util.table.CsvTableRendererTest History
Unit Test Job
Skipped SyncTest testSync History
Unit Test Job
Skipped HBaseTableTest testEmptyValuePut History
Unit Test Job
Skipped InMemoryTableTest testEmptyValuePut History
Unit Test Job
Skipped LevelDBTableTest testEmptyValuePut History
Unit Test Job
Skipped ArtifactInspectorTest testInvalidConfigApp History
Unit Test Job
Skipped ASMDatumCodecTest testSpeed History
Unit Test Job
Skipped KubeDiscoveryServiceTest io.cdap.cdap.k8s.discovery.KubeDiscoveryServiceTest History
Unit Test Job
Skipped FileMetadataCleanerTest testScanAndDeleteNewMetadata History
Unit Test Job
Skipped PodKillerTaskTest io.cdap.cdap.master.environment.k8s.PodKillerTaskTest History
Unit Test Job
Skipped EntityIdTest printToJson History
Unit Test Job
Skipped EntityIdTest printToString History
Unit Test Job
Skipped ApplicationSecurityTest testAbilityToSetSecurityManagerMultipleTimes History
Unit Test Job