Build #1,346

Build: #1346 failed Child of CDAP-DRC-5236

Build result summary

Details

Completed
Duration
38 minutes
Labels
None
Agent
bamboo-agent02
Revision
7b600a024902effb11ab15d21f248720878eaae0 7b600a024902effb11ab15d21f248720878eaae0
Total tests
2017
Fixed in
#1347 (Child of CDAP-DRC-5237)

Responsible

No one has taken responsibility for this failure

Code commits

Author Commit Message Commit date
greeshmaswaminathan <greeshmaswaminathan@users.noreply.github.com> greeshmaswaminathan <greeshmaswaminathan@users.noreply.github.com> 7b600a024902effb11ab15d21f248720878eaae0 7b600a024902effb11ab15d21f248720878eaae0 Merge pull request #13056 from cdapio/feature/CDAP-17555-Annotate-Delta-App
Provide method to enable capability in unit test
Jay Pandya <jaypandya@google.com> Jay Pandya <jaypandya@google.com> 7b4e5e74f24a1e95f4d1047e01ffc30401fb5daa 7b4e5e74f24a1e95f4d1047e01ffc30401fb5daa Merge pull request #13060 from cdapio/feature/CDAP-17563-fix
[CDAP-17563] Redeploy capability with newer artifacts if available.
Greeshma Swaminathan Greeshma Swaminathan 8762bc1ae7f575df13a6239b16203d11227cb3ed m 8762bc1ae7f575df13a6239b16203d11227cb3ed @VisibleForTesting
Greeshma Swaminathan Greeshma Swaminathan 850b50505c1a8639e7deda5324fc1a27adff382b m 850b50505c1a8639e7deda5324fc1a27adff382b Generating basic capability config for test
Jay Pandya <jaypandya@google.com> Jay Pandya <jaypandya@google.com> 114bc00930c808ecfa2008ec6bd506677e79a31c m 114bc00930c808ecfa2008ec6bd506677e79a31c Redeploy capability with newer artifacts if available.

Tests

New test failures 3
Status Test View job Duration
Collapse Failed CapabilityManagementServiceTest testCapabilityRefresh History
Unit Test Job 2 secs
io.cdap.cdap.common.ArtifactAlreadyExistsException: Artifact artifact:system.App.1.0.0 already exists.
	at io.cdap.cdap.internal.app.runtime.artifact.ArtifactStore.lambda$write$20(ArtifactStore.java:686)
	at io.cdap.cdap.spi.data.nosql.NoSqlTransactionRunner.lambda$run$0(NoSqlTransactionRunner.java:69)
	at io.cdap.cdap.spi.data.nosql.dataset.NoSQLTransactionals$1.finishExecute(NoSQLTransactionals.java:71)
	at io.cdap.cdap.spi.data.nosql.dataset.NoSQLTransactionals$1.execute(NoSQLTransactionals.java:50)
	at io.cdap.cdap.data2.transaction.Transactions$2.executeInternal(Transactions.java:261)
	at io.cdap.cdap.data2.transaction.Transactions$2.execute(Transactions.java:248)
	at io.cdap.cdap.spi.data.nosql.NoSqlTransactionRunner.run(NoSqlTransactionRunner.java:68)
(46 more lines...)
Collapse Failed CapabilityManagementServiceTest testCapabilityRefreshWithSameArtifact History
Unit Test Job 1 min
java.util.concurrent.TimeoutException: Timeout occurred. Expected RUNNING but found null.
	at io.cdap.cdap.common.utils.Tasks.waitFor(Tasks.java:70)
	at io.cdap.cdap.common.utils.Tasks.waitFor(Tasks.java:91)
	at io.cdap.cdap.common.utils.Tasks.waitFor(Tasks.java:130)
	at io.cdap.cdap.internal.app.services.http.AppFabricTestBase.waitState(AppFabricTestBase.java:960)
	at io.cdap.cdap.internal.capability.CapabilityManagementServiceTest.testCapabilityRefreshWithSameArtifact(CapabilityManagementServiceTest.java:363)
	at sun.reflect.NativeMethodAccessorImpl.invoke0(Native Method)
	at sun.reflect.NativeMethodAccessorImpl.invoke(NativeMethodAccessorImpl.java:62)
(36 more lines...)
Collapse Failed CapabilityManagementServiceTest testCapabilityRefreshWithNewArtifact History
Unit Test Job 2 secs
io.cdap.cdap.common.ArtifactAlreadyExistsException: Artifact artifact:system.App.1.0.0 already exists.
	at io.cdap.cdap.internal.app.runtime.artifact.ArtifactStore.lambda$write$20(ArtifactStore.java:686)
	at io.cdap.cdap.spi.data.nosql.NoSqlTransactionRunner.lambda$run$0(NoSqlTransactionRunner.java:69)
	at io.cdap.cdap.spi.data.nosql.dataset.NoSQLTransactionals$1.finishExecute(NoSQLTransactionals.java:71)
	at io.cdap.cdap.spi.data.nosql.dataset.NoSQLTransactionals$1.execute(NoSQLTransactionals.java:50)
	at io.cdap.cdap.data2.transaction.Transactions$2.executeInternal(Transactions.java:261)
	at io.cdap.cdap.data2.transaction.Transactions$2.execute(Transactions.java:248)
	at io.cdap.cdap.spi.data.nosql.NoSqlTransactionRunner.run(NoSqlTransactionRunner.java:68)
(46 more lines...)

JIRA issues

IssueDescriptionStatus
Unknown Issue TypeCDAP-17563Could not obtain issue details from JIRA