Build #1,185

Build: #1185 failed Child of CDAP-DRC-4986

Test results

  • 2,809 tests in total
  • 18 tests failed
  • 18 failures are new
  • 17 tests were quarantined / skipped
  • 141 minutes taken in total.
New test failures 18
Status Test View job Duration
Collapse Failed TransactionServiceClientTest testAbortTwice History
Unit Test Job 1 min
java.lang.RuntimeException: org.apache.thrift.TException: Unable to discover transaction service.
	at com.google.common.base.Throwables.propagate(Throwables.java:160)
	at org.apache.tephra.distributed.TransactionServiceClient.resetState(TransactionServiceClient.java:500)
	at io.cdap.cdap.data2.transaction.distributed.TransactionServiceClientTest.resetState(TransactionServiceClientTest.java:172)
	at sun.reflect.NativeMethodAccessorImpl.invoke0(Native Method)
	at sun.reflect.NativeMethodAccessorImpl.invoke(NativeMethodAccessorImpl.java:62)
	at sun.reflect.DelegatingMethodAccessorImpl.invoke(DelegatingMethodAccessorImpl.java:43)
	at java.lang.reflect.Method.invoke(Method.java:498)
(46 more lines...)
Collapse Failed TransactionServiceClientTest io.cdap.cdap.data2.transaction.distributed.TransactionServiceClientTest History
Unit Test Job 1 min
com.google.common.util.concurrent.UncheckedExecutionException: java.lang.Exception: Service failed while running
	at com.google.common.util.concurrent.Futures.wrapAndThrowUnchecked(Futures.java:1015)
	at com.google.common.util.concurrent.Futures.getUnchecked(Futures.java:1001)
	at com.google.common.util.concurrent.AbstractService.stopAndWait(AbstractService.java:225)
	at io.cdap.cdap.data2.transaction.distributed.TransactionServiceClientTest.afterClass(TransactionServiceClientTest.java:158)
	at sun.reflect.NativeMethodAccessorImpl.invoke0(Native Method)
	at sun.reflect.NativeMethodAccessorImpl.invoke(NativeMethodAccessorImpl.java:62)
	at sun.reflect.DelegatingMethodAccessorImpl.invoke(DelegatingMethodAccessorImpl.java:43)
(57 more lines...)
Collapse Failed TransactionServiceClientTest testCommitRaceHandling History
Unit Test Job 1 min
java.lang.RuntimeException: org.apache.thrift.TException: Unable to discover transaction service.
	at com.google.common.base.Throwables.propagate(Throwables.java:160)
	at org.apache.tephra.distributed.TransactionServiceClient.resetState(TransactionServiceClient.java:500)
	at io.cdap.cdap.data2.transaction.distributed.TransactionServiceClientTest.resetState(TransactionServiceClientTest.java:172)
	at sun.reflect.GeneratedMethodAccessor9.invoke(Unknown Source)
	at sun.reflect.DelegatingMethodAccessorImpl.invoke(DelegatingMethodAccessorImpl.java:43)
	at java.lang.reflect.Method.invoke(Method.java:498)
	at org.junit.runners.model.FrameworkMethod$1.runReflectiveCall(FrameworkMethod.java:47)
(45 more lines...)
Collapse Failed TransactionServiceClientTest testNegativeTimeout History
Unit Test Job 1 min
java.lang.RuntimeException: org.apache.thrift.TException: Unable to discover transaction service.
	at com.google.common.base.Throwables.propagate(Throwables.java:160)
	at org.apache.tephra.distributed.TransactionServiceClient.resetState(TransactionServiceClient.java:500)
	at io.cdap.cdap.data2.transaction.distributed.TransactionServiceClientTest.resetState(TransactionServiceClientTest.java:172)
	at sun.reflect.NativeMethodAccessorImpl.invoke0(Native Method)
	at sun.reflect.NativeMethodAccessorImpl.invoke(NativeMethodAccessorImpl.java:62)
	at sun.reflect.DelegatingMethodAccessorImpl.invoke(DelegatingMethodAccessorImpl.java:43)
	at java.lang.reflect.Method.invoke(Method.java:498)
(46 more lines...)
Collapse Failed TransactionServiceClientTest testGetSnapshot History
Unit Test Job 1 min
java.lang.RuntimeException: org.apache.thrift.TException: Unable to discover transaction service.
	at com.google.common.base.Throwables.propagate(Throwables.java:160)
	at org.apache.tephra.distributed.TransactionServiceClient.resetState(TransactionServiceClient.java:500)
	at io.cdap.cdap.data2.transaction.distributed.TransactionServiceClientTest.resetState(TransactionServiceClientTest.java:172)
	at sun.reflect.NativeMethodAccessorImpl.invoke0(Native Method)
	at sun.reflect.NativeMethodAccessorImpl.invoke(NativeMethodAccessorImpl.java:62)
	at sun.reflect.DelegatingMethodAccessorImpl.invoke(DelegatingMethodAccessorImpl.java:43)
	at java.lang.reflect.Method.invoke(Method.java:498)
(46 more lines...)
Collapse Failed TransactionServiceClientTest testReuseTx History
Unit Test Job 1 min
java.lang.RuntimeException: org.apache.thrift.TException: Unable to discover transaction service.
	at com.google.common.base.Throwables.propagate(Throwables.java:160)
	at org.apache.tephra.distributed.TransactionServiceClient.resetState(TransactionServiceClient.java:500)
	at io.cdap.cdap.data2.transaction.distributed.TransactionServiceClientTest.resetState(TransactionServiceClientTest.java:172)
	at sun.reflect.NativeMethodAccessorImpl.invoke0(Native Method)
	at sun.reflect.NativeMethodAccessorImpl.invoke(NativeMethodAccessorImpl.java:62)
	at sun.reflect.DelegatingMethodAccessorImpl.invoke(DelegatingMethodAccessorImpl.java:43)
	at java.lang.reflect.Method.invoke(Method.java:498)
(46 more lines...)
Collapse Failed TransactionServiceClientTest testAbortAfterCommit History
Unit Test Job 1 min
java.lang.RuntimeException: org.apache.thrift.TException: Unable to discover transaction service.
	at com.google.common.base.Throwables.propagate(Throwables.java:160)
	at org.apache.tephra.distributed.TransactionServiceClient.resetState(TransactionServiceClient.java:500)
	at io.cdap.cdap.data2.transaction.distributed.TransactionServiceClientTest.resetState(TransactionServiceClientTest.java:172)
	at sun.reflect.NativeMethodAccessorImpl.invoke0(Native Method)
	at sun.reflect.NativeMethodAccessorImpl.invoke(NativeMethodAccessorImpl.java:62)
	at sun.reflect.DelegatingMethodAccessorImpl.invoke(DelegatingMethodAccessorImpl.java:43)
	at java.lang.reflect.Method.invoke(Method.java:498)
(46 more lines...)
Collapse Failed TransactionServiceClientTest testLargeChangeSet History
Unit Test Job 1 min
java.lang.RuntimeException: org.apache.thrift.TException: Unable to discover transaction service.
	at com.google.common.base.Throwables.propagate(Throwables.java:160)
	at org.apache.tephra.distributed.TransactionServiceClient.resetState(TransactionServiceClient.java:500)
	at io.cdap.cdap.data2.transaction.distributed.TransactionServiceClientTest.resetState(TransactionServiceClientTest.java:172)
	at sun.reflect.NativeMethodAccessorImpl.invoke0(Native Method)
	at sun.reflect.NativeMethodAccessorImpl.invoke(NativeMethodAccessorImpl.java:62)
	at sun.reflect.DelegatingMethodAccessorImpl.invoke(DelegatingMethodAccessorImpl.java:43)
	at java.lang.reflect.Method.invoke(Method.java:498)
(46 more lines...)
Collapse Failed TransactionServiceClientTest testMultipleCommitsAtSameTime History
Unit Test Job 1 min
java.lang.RuntimeException: org.apache.thrift.TException: Unable to discover transaction service.
	at com.google.common.base.Throwables.propagate(Throwables.java:160)
	at org.apache.tephra.distributed.TransactionServiceClient.resetState(TransactionServiceClient.java:500)
	at io.cdap.cdap.data2.transaction.distributed.TransactionServiceClientTest.resetState(TransactionServiceClientTest.java:172)
	at sun.reflect.NativeMethodAccessorImpl.invoke0(Native Method)
	at sun.reflect.NativeMethodAccessorImpl.invoke(NativeMethodAccessorImpl.java:62)
	at sun.reflect.DelegatingMethodAccessorImpl.invoke(DelegatingMethodAccessorImpl.java:43)
	at java.lang.reflect.Method.invoke(Method.java:498)
(46 more lines...)
Collapse Failed TransactionServiceClientTest testExcessiveTimeout History
Unit Test Job 1 min
java.lang.RuntimeException: org.apache.thrift.TException: Unable to discover transaction service.
	at com.google.common.base.Throwables.propagate(Throwables.java:160)
	at org.apache.tephra.distributed.TransactionServiceClient.resetState(TransactionServiceClient.java:500)
	at io.cdap.cdap.data2.transaction.distributed.TransactionServiceClientTest.resetState(TransactionServiceClientTest.java:172)
	at sun.reflect.NativeMethodAccessorImpl.invoke0(Native Method)
	at sun.reflect.NativeMethodAccessorImpl.invoke(NativeMethodAccessorImpl.java:62)
	at sun.reflect.DelegatingMethodAccessorImpl.invoke(DelegatingMethodAccessorImpl.java:43)
	at java.lang.reflect.Method.invoke(Method.java:498)
(46 more lines...)
Collapse Failed TransactionServiceClientTest testInvalidateTx History
Unit Test Job 1 min
java.lang.RuntimeException: org.apache.thrift.TException: Unable to discover transaction service.
	at com.google.common.base.Throwables.propagate(Throwables.java:160)
	at org.apache.tephra.distributed.TransactionServiceClient.resetState(TransactionServiceClient.java:500)
	at io.cdap.cdap.data2.transaction.distributed.TransactionServiceClientTest.resetState(TransactionServiceClientTest.java:172)
	at sun.reflect.NativeMethodAccessorImpl.invoke0(Native Method)
	at sun.reflect.NativeMethodAccessorImpl.invoke(NativeMethodAccessorImpl.java:62)
	at sun.reflect.DelegatingMethodAccessorImpl.invoke(DelegatingMethodAccessorImpl.java:43)
	at java.lang.reflect.Method.invoke(Method.java:498)
(46 more lines...)
Collapse Failed TransactionServiceClientTest testTruncateInvalidTxBefore History
Unit Test Job 1 min
java.lang.RuntimeException: org.apache.thrift.TException: Unable to discover transaction service.
	at com.google.common.base.Throwables.propagate(Throwables.java:160)
	at org.apache.tephra.distributed.TransactionServiceClient.resetState(TransactionServiceClient.java:500)
	at io.cdap.cdap.data2.transaction.distributed.TransactionServiceClientTest.resetState(TransactionServiceClientTest.java:172)
	at sun.reflect.NativeMethodAccessorImpl.invoke0(Native Method)
	at sun.reflect.NativeMethodAccessorImpl.invoke(NativeMethodAccessorImpl.java:62)
	at sun.reflect.DelegatingMethodAccessorImpl.invoke(DelegatingMethodAccessorImpl.java:43)
	at java.lang.reflect.Method.invoke(Method.java:498)
(46 more lines...)
Collapse Failed TransactionServiceClientTest testCheckpointing History
Unit Test Job 1 min
java.lang.RuntimeException: org.apache.thrift.TException: Unable to discover transaction service.
	at com.google.common.base.Throwables.propagate(Throwables.java:160)
	at org.apache.tephra.distributed.TransactionServiceClient.resetState(TransactionServiceClient.java:500)
	at io.cdap.cdap.data2.transaction.distributed.TransactionServiceClientTest.resetState(TransactionServiceClientTest.java:172)
	at sun.reflect.NativeMethodAccessorImpl.invoke0(Native Method)
	at sun.reflect.NativeMethodAccessorImpl.invoke(NativeMethodAccessorImpl.java:62)
	at sun.reflect.DelegatingMethodAccessorImpl.invoke(DelegatingMethodAccessorImpl.java:43)
	at java.lang.reflect.Method.invoke(Method.java:498)
(46 more lines...)
Collapse Failed TransactionServiceClientTest testResetState History
Unit Test Job 1 min
java.lang.RuntimeException: org.apache.thrift.TException: Unable to discover transaction service.
	at com.google.common.base.Throwables.propagate(Throwables.java:160)
	at org.apache.tephra.distributed.TransactionServiceClient.resetState(TransactionServiceClient.java:500)
	at io.cdap.cdap.data2.transaction.distributed.TransactionServiceClientTest.resetState(TransactionServiceClientTest.java:172)
	at sun.reflect.NativeMethodAccessorImpl.invoke0(Native Method)
	at sun.reflect.NativeMethodAccessorImpl.invoke(NativeMethodAccessorImpl.java:62)
	at sun.reflect.DelegatingMethodAccessorImpl.invoke(DelegatingMethodAccessorImpl.java:43)
	at java.lang.reflect.Method.invoke(Method.java:498)
(46 more lines...)
Collapse Failed TransactionServiceClientTest testCommitTwice History
Unit Test Job 1 min
java.lang.RuntimeException: org.apache.thrift.TException: Unable to discover transaction service.
	at com.google.common.base.Throwables.propagate(Throwables.java:160)
	at org.apache.tephra.distributed.TransactionServiceClient.resetState(TransactionServiceClient.java:500)
	at io.cdap.cdap.data2.transaction.distributed.TransactionServiceClientTest.resetState(TransactionServiceClientTest.java:172)
	at sun.reflect.NativeMethodAccessorImpl.invoke0(Native Method)
	at sun.reflect.NativeMethodAccessorImpl.invoke(NativeMethodAccessorImpl.java:62)
	at sun.reflect.DelegatingMethodAccessorImpl.invoke(DelegatingMethodAccessorImpl.java:43)
	at java.lang.reflect.Method.invoke(Method.java:498)
(46 more lines...)
Collapse Failed TransactionServiceClientTest testGetInvalidSize History
Unit Test Job 1 min
java.lang.RuntimeException: org.apache.thrift.TException: Unable to discover transaction service.
	at com.google.common.base.Throwables.propagate(Throwables.java:160)
	at org.apache.tephra.distributed.TransactionServiceClient.resetState(TransactionServiceClient.java:500)
	at io.cdap.cdap.data2.transaction.distributed.TransactionServiceClientTest.resetState(TransactionServiceClientTest.java:172)
	at sun.reflect.NativeMethodAccessorImpl.invoke0(Native Method)
	at sun.reflect.NativeMethodAccessorImpl.invoke(NativeMethodAccessorImpl.java:62)
	at sun.reflect.DelegatingMethodAccessorImpl.invoke(DelegatingMethodAccessorImpl.java:43)
	at java.lang.reflect.Method.invoke(Method.java:498)
(46 more lines...)
Collapse Failed TransactionServiceClientTest testTruncateInvalidTx History
Unit Test Job 1 min
java.lang.RuntimeException: org.apache.thrift.TException: Unable to discover transaction service.
	at com.google.common.base.Throwables.propagate(Throwables.java:160)
	at org.apache.tephra.distributed.TransactionServiceClient.resetState(TransactionServiceClient.java:500)
	at io.cdap.cdap.data2.transaction.distributed.TransactionServiceClientTest.resetState(TransactionServiceClientTest.java:172)
	at sun.reflect.NativeMethodAccessorImpl.invoke0(Native Method)
	at sun.reflect.NativeMethodAccessorImpl.invoke(NativeMethodAccessorImpl.java:62)
	at sun.reflect.DelegatingMethodAccessorImpl.invoke(DelegatingMethodAccessorImpl.java:43)
	at java.lang.reflect.Method.invoke(Method.java:498)
(46 more lines...)
Collapse Failed TransactionServiceClientTest testUseNotStarted History
Unit Test Job 1 min
java.lang.RuntimeException: org.apache.thrift.TException: Unable to discover transaction service.
	at com.google.common.base.Throwables.propagate(Throwables.java:160)
	at org.apache.tephra.distributed.TransactionServiceClient.resetState(TransactionServiceClient.java:500)
	at io.cdap.cdap.data2.transaction.distributed.TransactionServiceClientTest.resetState(TransactionServiceClientTest.java:172)
	at sun.reflect.NativeMethodAccessorImpl.invoke0(Native Method)
	at sun.reflect.NativeMethodAccessorImpl.invoke(NativeMethodAccessorImpl.java:62)
	at sun.reflect.DelegatingMethodAccessorImpl.invoke(DelegatingMethodAccessorImpl.java:43)
	at java.lang.reflect.Method.invoke(Method.java:498)
(46 more lines...)
Skipped tests 17
Status Test Failing since View job
Skipped AltStyleTableRendererTest io.cdap.cdap.cli.util.table.AltStyleTableRendererTest History
Unit Test Job
Skipped CsvTableRendererTest io.cdap.cdap.cli.util.table.CsvTableRendererTest History
Unit Test Job
Skipped SyncTest testSync History
Unit Test Job
Skipped HBaseTableTest testEmptyValuePut History
Unit Test Job
Skipped InMemoryTableTest testEmptyValuePut History
Unit Test Job
Skipped LevelDBTableTest testEmptyValuePut History
Unit Test Job
Skipped ArtifactInspectorTest testInvalidConfigApp History
Unit Test Job
Skipped WorkflowHttpHandlerTest testWorkflowSchedules History
Unit Test Job
Skipped WorkflowHttpHandlerTest testWorkflowForkFailure History
Unit Test Job
Skipped ASMDatumCodecTest testSpeed History
Unit Test Job
Skipped KubeDiscoveryServiceTest io.cdap.cdap.k8s.discovery.KubeDiscoveryServiceTest History
Unit Test Job
Skipped FileMetadataCleanerTest testScanAndDeleteNewMetadata History
Unit Test Job
Skipped PodKillerTaskTest io.cdap.cdap.master.environment.k8s.PodKillerTaskTest History
Unit Test Job
Skipped EntityIdTest printToJson History
Unit Test Job
Skipped EntityIdTest printToString History
Unit Test Job
Skipped ApplicationSecurityTest testAbilityToSetSecurityManagerMultipleTimes History
Unit Test Job
Skipped TestFrameworkTestRun testDeployWorkflowApp History
Unit Test Job