Build #1,185

Build: #1185 failed Child of CDAP-DRC-4986

Build result summary

Details

Completed
Duration
151 minutes
Labels
None
Agent
bamboo-agent08
Revision
a16cdcee6a79c0a97f7608049dc86c898a2066b8 a16cdcee6a79c0a97f7608049dc86c898a2066b8
Total tests
2809
Fixed in
#1186 (Child of CDAP-DRC-4988)

Responsible

Code commits

Author Commit Message Commit date
Prashant Jaikumar Prashant Jaikumar a16cdcee6a79c0a97f7608049dc86c898a2066b8 a16cdcee6a79c0a97f7608049dc86c898a2066b8 Merge pull request #12467 from cdapio/metricswriterfix
[CDAP-16873] Fixed bug where metrics writer id was set incorrectly
Prashant Jaikumar Prashant Jaikumar d7e8e44a6bebef85dd81fc3b45a29e6098698e1d m d7e8e44a6bebef85dd81fc3b45a29e6098698e1d [CDAP-16873] Fixed bug where metrics writer id was set incorrectly
Fixed a bug in #12437.

Tests

New test failures 18
Status Test View job Duration
Collapse Failed TransactionServiceClientTest testAbortTwice History
Unit Test Job 1 min
java.lang.RuntimeException: org.apache.thrift.TException: Unable to discover transaction service.
	at com.google.common.base.Throwables.propagate(Throwables.java:160)
	at org.apache.tephra.distributed.TransactionServiceClient.resetState(TransactionServiceClient.java:500)
	at io.cdap.cdap.data2.transaction.distributed.TransactionServiceClientTest.resetState(TransactionServiceClientTest.java:172)
	at sun.reflect.NativeMethodAccessorImpl.invoke0(Native Method)
	at sun.reflect.NativeMethodAccessorImpl.invoke(NativeMethodAccessorImpl.java:62)
	at sun.reflect.DelegatingMethodAccessorImpl.invoke(DelegatingMethodAccessorImpl.java:43)
	at java.lang.reflect.Method.invoke(Method.java:498)
(46 more lines...)
Collapse Failed TransactionServiceClientTest io.cdap.cdap.data2.transaction.distributed.TransactionServiceClientTest History
Unit Test Job 1 min
com.google.common.util.concurrent.UncheckedExecutionException: java.lang.Exception: Service failed while running
	at com.google.common.util.concurrent.Futures.wrapAndThrowUnchecked(Futures.java:1015)
	at com.google.common.util.concurrent.Futures.getUnchecked(Futures.java:1001)
	at com.google.common.util.concurrent.AbstractService.stopAndWait(AbstractService.java:225)
	at io.cdap.cdap.data2.transaction.distributed.TransactionServiceClientTest.afterClass(TransactionServiceClientTest.java:158)
	at sun.reflect.NativeMethodAccessorImpl.invoke0(Native Method)
	at sun.reflect.NativeMethodAccessorImpl.invoke(NativeMethodAccessorImpl.java:62)
	at sun.reflect.DelegatingMethodAccessorImpl.invoke(DelegatingMethodAccessorImpl.java:43)
(57 more lines...)
Collapse Failed TransactionServiceClientTest testCommitRaceHandling History
Unit Test Job 1 min
java.lang.RuntimeException: org.apache.thrift.TException: Unable to discover transaction service.
	at com.google.common.base.Throwables.propagate(Throwables.java:160)
	at org.apache.tephra.distributed.TransactionServiceClient.resetState(TransactionServiceClient.java:500)
	at io.cdap.cdap.data2.transaction.distributed.TransactionServiceClientTest.resetState(TransactionServiceClientTest.java:172)
	at sun.reflect.GeneratedMethodAccessor9.invoke(Unknown Source)
	at sun.reflect.DelegatingMethodAccessorImpl.invoke(DelegatingMethodAccessorImpl.java:43)
	at java.lang.reflect.Method.invoke(Method.java:498)
	at org.junit.runners.model.FrameworkMethod$1.runReflectiveCall(FrameworkMethod.java:47)
(45 more lines...)
Collapse Failed TransactionServiceClientTest testNegativeTimeout History
Unit Test Job 1 min
java.lang.RuntimeException: org.apache.thrift.TException: Unable to discover transaction service.
	at com.google.common.base.Throwables.propagate(Throwables.java:160)
	at org.apache.tephra.distributed.TransactionServiceClient.resetState(TransactionServiceClient.java:500)
	at io.cdap.cdap.data2.transaction.distributed.TransactionServiceClientTest.resetState(TransactionServiceClientTest.java:172)
	at sun.reflect.NativeMethodAccessorImpl.invoke0(Native Method)
	at sun.reflect.NativeMethodAccessorImpl.invoke(NativeMethodAccessorImpl.java:62)
	at sun.reflect.DelegatingMethodAccessorImpl.invoke(DelegatingMethodAccessorImpl.java:43)
	at java.lang.reflect.Method.invoke(Method.java:498)
(46 more lines...)
Collapse Failed TransactionServiceClientTest testGetSnapshot History
Unit Test Job 1 min
java.lang.RuntimeException: org.apache.thrift.TException: Unable to discover transaction service.
	at com.google.common.base.Throwables.propagate(Throwables.java:160)
	at org.apache.tephra.distributed.TransactionServiceClient.resetState(TransactionServiceClient.java:500)
	at io.cdap.cdap.data2.transaction.distributed.TransactionServiceClientTest.resetState(TransactionServiceClientTest.java:172)
	at sun.reflect.NativeMethodAccessorImpl.invoke0(Native Method)
	at sun.reflect.NativeMethodAccessorImpl.invoke(NativeMethodAccessorImpl.java:62)
	at sun.reflect.DelegatingMethodAccessorImpl.invoke(DelegatingMethodAccessorImpl.java:43)
	at java.lang.reflect.Method.invoke(Method.java:498)
(46 more lines...)
Collapse Failed TransactionServiceClientTest testReuseTx History
Unit Test Job 1 min
java.lang.RuntimeException: org.apache.thrift.TException: Unable to discover transaction service.
	at com.google.common.base.Throwables.propagate(Throwables.java:160)
	at org.apache.tephra.distributed.TransactionServiceClient.resetState(TransactionServiceClient.java:500)
	at io.cdap.cdap.data2.transaction.distributed.TransactionServiceClientTest.resetState(TransactionServiceClientTest.java:172)
	at sun.reflect.NativeMethodAccessorImpl.invoke0(Native Method)
	at sun.reflect.NativeMethodAccessorImpl.invoke(NativeMethodAccessorImpl.java:62)
	at sun.reflect.DelegatingMethodAccessorImpl.invoke(DelegatingMethodAccessorImpl.java:43)
	at java.lang.reflect.Method.invoke(Method.java:498)
(46 more lines...)
Collapse Failed TransactionServiceClientTest testAbortAfterCommit History
Unit Test Job 1 min
java.lang.RuntimeException: org.apache.thrift.TException: Unable to discover transaction service.
	at com.google.common.base.Throwables.propagate(Throwables.java:160)
	at org.apache.tephra.distributed.TransactionServiceClient.resetState(TransactionServiceClient.java:500)
	at io.cdap.cdap.data2.transaction.distributed.TransactionServiceClientTest.resetState(TransactionServiceClientTest.java:172)
	at sun.reflect.NativeMethodAccessorImpl.invoke0(Native Method)
	at sun.reflect.NativeMethodAccessorImpl.invoke(NativeMethodAccessorImpl.java:62)
	at sun.reflect.DelegatingMethodAccessorImpl.invoke(DelegatingMethodAccessorImpl.java:43)
	at java.lang.reflect.Method.invoke(Method.java:498)
(46 more lines...)
Collapse Failed TransactionServiceClientTest testLargeChangeSet History
Unit Test Job 1 min
java.lang.RuntimeException: org.apache.thrift.TException: Unable to discover transaction service.
	at com.google.common.base.Throwables.propagate(Throwables.java:160)
	at org.apache.tephra.distributed.TransactionServiceClient.resetState(TransactionServiceClient.java:500)
	at io.cdap.cdap.data2.transaction.distributed.TransactionServiceClientTest.resetState(TransactionServiceClientTest.java:172)
	at sun.reflect.NativeMethodAccessorImpl.invoke0(Native Method)
	at sun.reflect.NativeMethodAccessorImpl.invoke(NativeMethodAccessorImpl.java:62)
	at sun.reflect.DelegatingMethodAccessorImpl.invoke(DelegatingMethodAccessorImpl.java:43)
	at java.lang.reflect.Method.invoke(Method.java:498)
(46 more lines...)
Collapse Failed TransactionServiceClientTest testMultipleCommitsAtSameTime History
Unit Test Job 1 min
java.lang.RuntimeException: org.apache.thrift.TException: Unable to discover transaction service.
	at com.google.common.base.Throwables.propagate(Throwables.java:160)
	at org.apache.tephra.distributed.TransactionServiceClient.resetState(TransactionServiceClient.java:500)
	at io.cdap.cdap.data2.transaction.distributed.TransactionServiceClientTest.resetState(TransactionServiceClientTest.java:172)
	at sun.reflect.NativeMethodAccessorImpl.invoke0(Native Method)
	at sun.reflect.NativeMethodAccessorImpl.invoke(NativeMethodAccessorImpl.java:62)
	at sun.reflect.DelegatingMethodAccessorImpl.invoke(DelegatingMethodAccessorImpl.java:43)
	at java.lang.reflect.Method.invoke(Method.java:498)
(46 more lines...)
Collapse Failed TransactionServiceClientTest testExcessiveTimeout History
Unit Test Job 1 min
java.lang.RuntimeException: org.apache.thrift.TException: Unable to discover transaction service.
	at com.google.common.base.Throwables.propagate(Throwables.java:160)
	at org.apache.tephra.distributed.TransactionServiceClient.resetState(TransactionServiceClient.java:500)
	at io.cdap.cdap.data2.transaction.distributed.TransactionServiceClientTest.resetState(TransactionServiceClientTest.java:172)
	at sun.reflect.NativeMethodAccessorImpl.invoke0(Native Method)
	at sun.reflect.NativeMethodAccessorImpl.invoke(NativeMethodAccessorImpl.java:62)
	at sun.reflect.DelegatingMethodAccessorImpl.invoke(DelegatingMethodAccessorImpl.java:43)
	at java.lang.reflect.Method.invoke(Method.java:498)
(46 more lines...)
Collapse Failed TransactionServiceClientTest testInvalidateTx History
Unit Test Job 1 min
java.lang.RuntimeException: org.apache.thrift.TException: Unable to discover transaction service.
	at com.google.common.base.Throwables.propagate(Throwables.java:160)
	at org.apache.tephra.distributed.TransactionServiceClient.resetState(TransactionServiceClient.java:500)
	at io.cdap.cdap.data2.transaction.distributed.TransactionServiceClientTest.resetState(TransactionServiceClientTest.java:172)
	at sun.reflect.NativeMethodAccessorImpl.invoke0(Native Method)
	at sun.reflect.NativeMethodAccessorImpl.invoke(NativeMethodAccessorImpl.java:62)
	at sun.reflect.DelegatingMethodAccessorImpl.invoke(DelegatingMethodAccessorImpl.java:43)
	at java.lang.reflect.Method.invoke(Method.java:498)
(46 more lines...)
Collapse Failed TransactionServiceClientTest testTruncateInvalidTxBefore History
Unit Test Job 1 min
java.lang.RuntimeException: org.apache.thrift.TException: Unable to discover transaction service.
	at com.google.common.base.Throwables.propagate(Throwables.java:160)
	at org.apache.tephra.distributed.TransactionServiceClient.resetState(TransactionServiceClient.java:500)
	at io.cdap.cdap.data2.transaction.distributed.TransactionServiceClientTest.resetState(TransactionServiceClientTest.java:172)
	at sun.reflect.NativeMethodAccessorImpl.invoke0(Native Method)
	at sun.reflect.NativeMethodAccessorImpl.invoke(NativeMethodAccessorImpl.java:62)
	at sun.reflect.DelegatingMethodAccessorImpl.invoke(DelegatingMethodAccessorImpl.java:43)
	at java.lang.reflect.Method.invoke(Method.java:498)
(46 more lines...)
Collapse Failed TransactionServiceClientTest testCheckpointing History
Unit Test Job 1 min
java.lang.RuntimeException: org.apache.thrift.TException: Unable to discover transaction service.
	at com.google.common.base.Throwables.propagate(Throwables.java:160)
	at org.apache.tephra.distributed.TransactionServiceClient.resetState(TransactionServiceClient.java:500)
	at io.cdap.cdap.data2.transaction.distributed.TransactionServiceClientTest.resetState(TransactionServiceClientTest.java:172)
	at sun.reflect.NativeMethodAccessorImpl.invoke0(Native Method)
	at sun.reflect.NativeMethodAccessorImpl.invoke(NativeMethodAccessorImpl.java:62)
	at sun.reflect.DelegatingMethodAccessorImpl.invoke(DelegatingMethodAccessorImpl.java:43)
	at java.lang.reflect.Method.invoke(Method.java:498)
(46 more lines...)
Collapse Failed TransactionServiceClientTest testResetState History
Unit Test Job 1 min
java.lang.RuntimeException: org.apache.thrift.TException: Unable to discover transaction service.
	at com.google.common.base.Throwables.propagate(Throwables.java:160)
	at org.apache.tephra.distributed.TransactionServiceClient.resetState(TransactionServiceClient.java:500)
	at io.cdap.cdap.data2.transaction.distributed.TransactionServiceClientTest.resetState(TransactionServiceClientTest.java:172)
	at sun.reflect.NativeMethodAccessorImpl.invoke0(Native Method)
	at sun.reflect.NativeMethodAccessorImpl.invoke(NativeMethodAccessorImpl.java:62)
	at sun.reflect.DelegatingMethodAccessorImpl.invoke(DelegatingMethodAccessorImpl.java:43)
	at java.lang.reflect.Method.invoke(Method.java:498)
(46 more lines...)
Collapse Failed TransactionServiceClientTest testCommitTwice History
Unit Test Job 1 min
java.lang.RuntimeException: org.apache.thrift.TException: Unable to discover transaction service.
	at com.google.common.base.Throwables.propagate(Throwables.java:160)
	at org.apache.tephra.distributed.TransactionServiceClient.resetState(TransactionServiceClient.java:500)
	at io.cdap.cdap.data2.transaction.distributed.TransactionServiceClientTest.resetState(TransactionServiceClientTest.java:172)
	at sun.reflect.NativeMethodAccessorImpl.invoke0(Native Method)
	at sun.reflect.NativeMethodAccessorImpl.invoke(NativeMethodAccessorImpl.java:62)
	at sun.reflect.DelegatingMethodAccessorImpl.invoke(DelegatingMethodAccessorImpl.java:43)
	at java.lang.reflect.Method.invoke(Method.java:498)
(46 more lines...)
Collapse Failed TransactionServiceClientTest testGetInvalidSize History
Unit Test Job 1 min
java.lang.RuntimeException: org.apache.thrift.TException: Unable to discover transaction service.
	at com.google.common.base.Throwables.propagate(Throwables.java:160)
	at org.apache.tephra.distributed.TransactionServiceClient.resetState(TransactionServiceClient.java:500)
	at io.cdap.cdap.data2.transaction.distributed.TransactionServiceClientTest.resetState(TransactionServiceClientTest.java:172)
	at sun.reflect.NativeMethodAccessorImpl.invoke0(Native Method)
	at sun.reflect.NativeMethodAccessorImpl.invoke(NativeMethodAccessorImpl.java:62)
	at sun.reflect.DelegatingMethodAccessorImpl.invoke(DelegatingMethodAccessorImpl.java:43)
	at java.lang.reflect.Method.invoke(Method.java:498)
(46 more lines...)
Collapse Failed TransactionServiceClientTest testTruncateInvalidTx History
Unit Test Job 1 min
java.lang.RuntimeException: org.apache.thrift.TException: Unable to discover transaction service.
	at com.google.common.base.Throwables.propagate(Throwables.java:160)
	at org.apache.tephra.distributed.TransactionServiceClient.resetState(TransactionServiceClient.java:500)
	at io.cdap.cdap.data2.transaction.distributed.TransactionServiceClientTest.resetState(TransactionServiceClientTest.java:172)
	at sun.reflect.NativeMethodAccessorImpl.invoke0(Native Method)
	at sun.reflect.NativeMethodAccessorImpl.invoke(NativeMethodAccessorImpl.java:62)
	at sun.reflect.DelegatingMethodAccessorImpl.invoke(DelegatingMethodAccessorImpl.java:43)
	at java.lang.reflect.Method.invoke(Method.java:498)
(46 more lines...)
Collapse Failed TransactionServiceClientTest testUseNotStarted History
Unit Test Job 1 min
java.lang.RuntimeException: org.apache.thrift.TException: Unable to discover transaction service.
	at com.google.common.base.Throwables.propagate(Throwables.java:160)
	at org.apache.tephra.distributed.TransactionServiceClient.resetState(TransactionServiceClient.java:500)
	at io.cdap.cdap.data2.transaction.distributed.TransactionServiceClientTest.resetState(TransactionServiceClientTest.java:172)
	at sun.reflect.NativeMethodAccessorImpl.invoke0(Native Method)
	at sun.reflect.NativeMethodAccessorImpl.invoke(NativeMethodAccessorImpl.java:62)
	at sun.reflect.DelegatingMethodAccessorImpl.invoke(DelegatingMethodAccessorImpl.java:43)
	at java.lang.reflect.Method.invoke(Method.java:498)
(46 more lines...)

JIRA issues

IssueDescriptionStatus
Unknown Issue TypeCDAP-16873Could not obtain issue details from JIRA