Build #1,152

Build: #1152 failed Child of CDAP-DRC-4949

Build result summary

Details

Completed
Duration
40 minutes
Labels
None
Agent
bamboo-agent02
Revision
14f0dee0746387d70e78c74c437d3ee6664b7eef 14f0dee0746387d70e78c74c437d3ee6664b7eef
Total tests
1975
Fixed in
#1153 (Child of CDAP-DRC-4950)

Responsible

Code commits

Author Commit Message Commit date
yukiej <yukiej@gmail.com> yukiej <yukiej@gmail.com> 14f0dee0746387d70e78c74c437d3ee6664b7eef 14f0dee0746387d70e78c74c437d3ee6664b7eef Merge pull request #12317 from cdapio/bugfix-ui/CDAP-16960-preview-error-msg-6.3
[CDAP-16960] Preview error handling
Jenna Choi <jena.choi1106@gmail.com> Jenna Choi <jena.choi1106@gmail.com> bb00dfefe2f288d23125eeb7be8e1d0be80585ad bb00dfefe2f288d23125eeb7be8e1d0be80585ad Merge pull request #12302 from cdapio/bugfix-ui/CDAP-16939
[CDAP-16939] let Multiselect component accept an array of string for 'options'
Yuki Jung Yuki Jung 6c1798d7b375550a796df3d58a257ed871ab022b 6c1798d7b375550a796df3d58a257ed871ab022b Add error handling backend returns error while fetching preview and i18n for previewData messages
Jenna Choi <jena.choi1106@gmail.com> Jenna Choi <jena.choi1106@gmail.com> 779133767b8d9c28c0aabde075bca175cb560ac6 m 779133767b8d9c28c0aabde075bca175cb560ac6 [CDAP-16939] let Multiselect component accept an array of string for 'options'
Ajai <1452845+ajainarayanan@users.noreply.github.com> Ajai <1452845+ajainarayanan@users.noreply.github.com> 9f5a5cef4553855208caa8fc0342a65a7a246263 9f5a5cef4553855208caa8fc0342a65a7a246263 Merge pull request #12298 from cdapio/bugfix-ui/CDAP-16617-restore-add-entity-to-previous-version
[CDAP-16617] Revert add entity modal to be smaller size + fix error m…

Tests

New test failures 2
Status Test View job Duration
Collapse Failed WorkerProgramRunnerTest testWorkerWithMisbehavedDataset History
Unit Test Job 10 secs
java.util.concurrent.ExecutionException: io.cdap.cdap.api.dataset.DatasetManagementException: Failed to add module io.cdap.cdap.AppWithMisbehavedDataset$MisbehavedDataset, details: Response code: 500, message: 'Internal Server Error', body: 'canCommit() is called for transaction 1592345792012000000 that is not in progress (it is known to be invalid)'
	at com.google.common.util.concurrent.AbstractFuture$Sync.getValue(AbstractFuture.java:294)
	at com.google.common.util.concurrent.AbstractFuture$Sync.get(AbstractFuture.java:281)
	at com.google.common.util.concurrent.AbstractFuture.get(AbstractFuture.java:116)
	at io.cdap.cdap.internal.AppFabricTestHelper.deployApplicationWithManager(AppFabricTestHelper.java:291)
	at io.cdap.cdap.internal.AppFabricTestHelper.deployApplicationWithManager(AppFabricTestHelper.java:272)
	at io.cdap.cdap.internal.AppFabricTestHelper.deployApplicationWithManager(AppFabricTestHelper.java:261)
	at io.cdap.cdap.internal.app.runtime.worker.WorkerProgramRunnerTest.testWorkerWithMisbehavedDataset(WorkerProgramRunnerTest.java:147)
(54 more lines...)
Collapse Failed InstanceOperationHttpHandlerTest io.cdap.cdap.internal.app.services.http.handlers.InstanceOperationHttpHandlerTest History
Unit Test Job 1 min
java.util.concurrent.ExecutionException: java.net.SocketTimeoutException: Read timed out
	at io.cdap.cdap.common.utils.Tasks.waitFor(Tasks.java:63)
	at io.cdap.cdap.common.utils.Tasks.waitFor(Tasks.java:91)
	at io.cdap.cdap.common.utils.Tasks.waitFor(Tasks.java:130)
	at io.cdap.cdap.internal.app.services.http.AppFabricTestBase.deleteNamespaces(AppFabricTestBase.java:1003)
	at io.cdap.cdap.internal.app.services.http.AppFabricTestBase.afterClass(AppFabricTestBase.java:299)
	at sun.reflect.NativeMethodAccessorImpl.invoke0(Native Method)
	at sun.reflect.NativeMethodAccessorImpl.invoke(NativeMethodAccessorImpl.java:62)
(44 more lines...)

JIRA issues

IssueDescriptionStatus
Unknown Issue TypeCDAP-16617Could not obtain issue details from JIRA
Unknown Issue TypeCDAP-16869Could not obtain issue details from JIRA
Unknown Issue TypeCDAP-16871Could not obtain issue details from JIRA
Unknown Issue TypeCDAP-16939Could not obtain issue details from JIRA
Unknown Issue TypeCDAP-16960Could not obtain issue details from JIRA