Build #1,132

Build: #1132 failed Child of CDAP-DRC-4915

Build result summary

Details

Completed
Duration
119 minutes
Labels
None
Agent
bamboo-agent08
Revision
fd28121a76a602a90e9a3abe12922b61a398fd1b fd28121a76a602a90e9a3abe12922b61a398fd1b
Total tests
2780
Fixed in
#1133 (Child of CDAP-DRC-4916)

Responsible

Code commits

Author Commit Message Commit date
Ajai <1452845+ajainarayanan@users.noreply.github.com> Ajai <1452845+ajainarayanan@users.noreply.github.com> fd28121a76a602a90e9a3abe12922b61a398fd1b fd28121a76a602a90e9a3abe12922b61a398fd1b Merge pull request #12087 from cdapio/feature-ui/CDAP-16607
[CDAP-16607] Expands plugin configuration, plugin templates and post …
Terence Yim <885032+chtyim@users.noreply.github.com> Terence Yim <885032+chtyim@users.noreply.github.com> 57580aff9675f66b4d09f227c712b303980af8b9 57580aff9675f66b4d09f227c712b303980af8b9 Merge pull request #12239 from cdapio/feature/CDAP-16884-retry-pause
(CDAP-16884) Fix SparkDriverService to pause between failure retry
Ajai Narayan Ajai Narayan e408e0e2246990a86ab7d27ed716b6b5504a6fec e408e0e2246990a86ab7d27ed716b6b5504a6fec [CDAP-16607] Expands plugin configuration, plugin templates and post run action, import & confirmation modals to expand to full screen
Terence Yim Terence Yim 5400b9e01cac3eb0d8ed91e967ba09d300b02681 m 5400b9e01cac3eb0d8ed91e967ba09d300b02681 (CDAP-16884) Fix SparkDriverService to pause between failure retry
- Also added more information to the error logs

Tests

New test failures 5
Status Test View job Duration
Collapse Failed AutoJoinerTest io.cdap.cdap.datapipeline.AutoJoinerTest History
Unit Test Job < 1 sec
io.cdap.cdap.common.NamespaceCannotBeDeletedException: 'namespace:default' could not be deleted. Reason: Some programs are currently running in namespace 'namespace:default', please stop them before deleting namespace
	at io.cdap.cdap.internal.app.namespace.DefaultNamespaceAdmin.delete(DefaultNamespaceAdmin.java:263)
	at io.cdap.cdap.test.TestBase.finish(TestBase.java:507)
	at sun.reflect.NativeMethodAccessorImpl.invoke0(Native Method)
	at sun.reflect.NativeMethodAccessorImpl.invoke(NativeMethodAccessorImpl.java:62)
	at sun.reflect.DelegatingMethodAccessorImpl.invoke(DelegatingMethodAccessorImpl.java:43)
	at java.lang.reflect.Method.invoke(Method.java:498)
	at org.junit.runners.model.FrameworkMethod$1.runReflectiveCall(FrameworkMethod.java:47)
(25 more lines...)
Collapse Failed AutoJoinerTest testNullNotEqual History
Unit Test Job 5 mins
java.util.concurrent.TimeoutException: Timeout occurred. Expected true but found false.
	at io.cdap.cdap.common.utils.Tasks.waitFor(Tasks.java:70)
	at io.cdap.cdap.common.utils.Tasks.waitFor(Tasks.java:91)
	at io.cdap.cdap.test.AbstractProgramManager.waitForRuns(AbstractProgramManager.java:109)
	at io.cdap.cdap.test.AbstractProgramManager.startAndWaitForRun(AbstractProgramManager.java:80)
	at io.cdap.cdap.test.AbstractProgramManager.startAndWaitForRun(AbstractProgramManager.java:71)
	at io.cdap.cdap.test.AbstractProgramManager.startAndWaitForRun(AbstractProgramManager.java:65)
	at io.cdap.cdap.datapipeline.AutoJoinerTest.testNullEquality(AutoJoinerTest.java:711)
(43 more lines...)
Collapse Failed ReducibleAggregatorTest io.cdap.cdap.datapipeline.ReducibleAggregatorTest History
Unit Test Job < 1 sec
io.cdap.cdap.common.NamespaceCannotBeDeletedException: 'namespace:default' could not be deleted. Reason: Some programs are currently running in namespace 'namespace:default', please stop them before deleting namespace
	at io.cdap.cdap.internal.app.namespace.DefaultNamespaceAdmin.delete(DefaultNamespaceAdmin.java:263)
	at io.cdap.cdap.test.TestBase.finish(TestBase.java:507)
	at sun.reflect.NativeMethodAccessorImpl.invoke0(Native Method)
	at sun.reflect.NativeMethodAccessorImpl.invoke(NativeMethodAccessorImpl.java:62)
	at sun.reflect.DelegatingMethodAccessorImpl.invoke(DelegatingMethodAccessorImpl.java:43)
	at java.lang.reflect.Method.invoke(Method.java:498)
	at org.junit.runners.model.FrameworkMethod$1.runReflectiveCall(FrameworkMethod.java:47)
(25 more lines...)
Collapse Failed ReducibleAggregatorTest testFieldCountAgg History
Unit Test Job 5 mins
java.util.concurrent.TimeoutException: Timeout occurred. Expected true but found false.
	at io.cdap.cdap.common.utils.Tasks.waitFor(Tasks.java:70)
	at io.cdap.cdap.common.utils.Tasks.waitFor(Tasks.java:91)
	at io.cdap.cdap.test.AbstractProgramManager.waitForRuns(AbstractProgramManager.java:109)
	at io.cdap.cdap.test.AbstractProgramManager.waitForRuns(AbstractProgramManager.java:103)
	at io.cdap.cdap.test.AbstractProgramManager.waitForRun(AbstractProgramManager.java:97)
	at io.cdap.cdap.datapipeline.ReducibleAggregatorTest.testFieldCountAgg(ReducibleAggregatorTest.java:197)
	at io.cdap.cdap.datapipeline.ReducibleAggregatorTest.testFieldCountAgg(ReducibleAggregatorTest.java:145)
(42 more lines...)
Collapse Failed PreviewDataPipelineTest testMultiPhasePreview History
Unit Test Job 5 mins
java.util.concurrent.TimeoutException: Timeout occurred. Expected COMPLETED but found RUN_FAILED.
	at io.cdap.cdap.common.utils.Tasks.waitFor(Tasks.java:70)
	at io.cdap.cdap.common.utils.Tasks.waitFor(Tasks.java:91)
	at io.cdap.cdap.common.utils.Tasks.waitFor(Tasks.java:130)
	at io.cdap.cdap.datapipeline.preview.PreviewDataPipelineTest.testMultiplePhase(PreviewDataPipelineTest.java:281)
	at io.cdap.cdap.datapipeline.preview.PreviewDataPipelineTest.testMultiPhasePreview(PreviewDataPipelineTest.java:178)
	at sun.reflect.NativeMethodAccessorImpl.invoke0(Native Method)
	at sun.reflect.NativeMethodAccessorImpl.invoke(NativeMethodAccessorImpl.java:62)
(40 more lines...)

JIRA issues

IssueDescriptionStatus
Unknown Issue TypeCDAP-16607Could not obtain issue details from JIRA
Unknown Issue TypeCDAP-16884Could not obtain issue details from JIRA