Build #3,165

Build: #3165 failed Manual run by Vinisha Vyasa

Build result summary

Details

Completed
Duration
1 minute
Labels
None
Agent
bamboo-agent09
Revision
7596271ddca8316034e93238c0b6ba761f261d28 7596271ddca8316034e93238c0b6ba761f261d28
Total tests
1
Failing since
#1712 (Scheduled – )

Responsible

This build has been failing since #1712
No one has taken responsibility

Configuration changes

Plan configuration has changed since the last successful build. See the plan audit log for more details.

Tests

Existing test failures 1
Status Test Failing since View job Duration
java.util.concurrent.ExecutionException: java.lang.RuntimeException: co.cask.cdap.common.NotFoundException: 'program:lrt.regularTable.-SNAPSHOT.service.DatasetService' was not found.
	at co.cask.cdap.client.ServiceClient.get(ServiceClient.java:99)
	at co.cask.cdap.client.ServiceClient.getServiceURL(ServiceClient.java:171)
	at co.cask.cdap.test.remote.RemoteServiceManager.getServiceURL(RemoteServiceManager.java:80)
	at co.cask.cdap.test.AudiTestBase.deployServiceForDataset(AudiTestBase.java:267)
	at co.cask.cdap.test.AudiTestBase.getKVTableDataset(AudiTestBase.java:248)
	at co.cask.cdap.longrunning.increment.IncrementTest.access$000(IncrementTest.java:40)