Build #11

Build: #11 failed Manual run by Andreas Neumann

Build result summary

Details

Completed
Duration
269 minutes
Flags
Custom build
Labels
None
Revisions
CDAP Integration Tests
bc11cea9017da1cc372188333542eff0fbb52af1 bc11cea9017da1cc372188333542eff0fbb52af1
Coopr-internal
a8a085c1a4a527aca6692f9ed196b787fe458716 a8a085c1a4a527aca6692f9ed196b787fe458716
Total tests
178
Failing since
#5 (Rebuilt by Nishith Nand)

Responsible

Code commits

CDAP Integration Tests
Author Commit Message Commit date
Ali Anwar Ali Anwar bc11cea9017da1cc372188333542eff0fbb52af1 bc11cea9017da1cc372188333542eff0fbb52af1 Merge pull request #823 from caskdata/release/4.3
Merging release/4.3 to develop
Ali Anwar Ali Anwar a2c5365590f99b81ffcfdf773d5f93d63892413e a2c5365590f99b81ffcfdf773d5f93d63892413e Bump cdap sentry extension dependency version to 0.6.0.
Ali Anwar Ali Anwar 39db448ed0db2603f309244bc183daf6886232aa 39db448ed0db2603f309244bc183daf6886232aa Merge pull request #827 from caskdata/release/4.3-bump-version
Bump cdap dependency to 4.3.0
Ali Anwar Ali Anwar 519cdc557b30e481798cce2615e1f37f12a88bf8 519cdc557b30e481798cce2615e1f37f12a88bf8 Bump cdap dependency to 4.3.0
Ali Anwar Ali Anwar 5d0551f20105c2bf6d9c773b4faeb61bbccf54e4 5d0551f20105c2bf6d9c773b4faeb61bbccf54e4 Merge pull request #825 from caskdata/fix-compilation
Fix compilation.

Tests

New test failures 2
Status Test View job Duration
Collapse Failed ExploreTest test History
Distro Tests - CDH 5.10 2 mins
java.util.concurrent.ExecutionException: java.sql.SQLException: Error while processing statement: FAILED: Execution Error, return code 2 from org.apache.hadoop.hive.ql.exec.mr.MapRedTask
	at com.google.common.util.concurrent.AbstractFuture$Sync.getValue(AbstractFuture.java:294)
	at com.google.common.util.concurrent.AbstractFuture$Sync.get(AbstractFuture.java:281)
	at com.google.common.util.concurrent.AbstractFuture.get(AbstractFuture.java:116)
	at co.cask.cdap.apps.explore.ExploreTest.testEqualityJoin(ExploreTest.java:258)
	at co.cask.cdap.apps.explore.ExploreTest.test(ExploreTest.java:72)
Caused by: java.sql.SQLException: Error while processing statement: FAILED: Execution Error, return code 2 from org.apache.hadoop.hive.ql.exec.mr.MapRedTask
	at co.cask.cdap.explore.client.AbstractExploreClient$23.onSuccess(AbstractExploreClient.java:401)
(8 more lines...)
Collapse Failed ExploreTest testSubqueryInWhereClause History
Distro Tests - CDH 5.10 3 mins
java.util.concurrent.ExecutionException: java.sql.SQLException: Error while processing statement: FAILED: Execution Error, return code 2 from org.apache.hadoop.hive.ql.exec.mr.MapRedTask
	at com.google.common.util.concurrent.AbstractFuture$Sync.getValue(AbstractFuture.java:294)
	at com.google.common.util.concurrent.AbstractFuture$Sync.get(AbstractFuture.java:281)
	at com.google.common.util.concurrent.AbstractFuture.get(AbstractFuture.java:116)
	at co.cask.cdap.apps.explore.ExploreTest.testSubqueryInWhereClause(ExploreTest.java:573)
Caused by: java.sql.SQLException: Error while processing statement: FAILED: Execution Error, return code 2 from org.apache.hadoop.hive.ql.exec.mr.MapRedTask
	at co.cask.cdap.explore.client.AbstractExploreClient$23.onSuccess(AbstractExploreClient.java:401)
	at co.cask.cdap.explore.client.AbstractExploreClient$23$1.run(AbstractExploreClient.java:395)
(7 more lines...)
Fixed tests 42
Status Test Failing since View job Duration
Successful KVTableWithProjectionTest testKVTableWithProjection History
Failing since build #5 (Rebuilt by Nishith Nand) Distro Tests - CDH 5.10 2 mins
Successful KVTableWithProjectionTest testKVTableWithProjection History
Failing since build #7 (Manual run by Chris Gianelloni) Distro Tests - MapR 5.2 2 mins
Successful StreamTPFSWithProjectionTest testStreamTPFSWithProjection History
Failing since build #5 (Rebuilt by Nishith Nand) Distro Tests - CDH 5.10 4 mins
Successful StreamTPFSWithProjectionTest testStreamTPFSWithProjection History
Failing since build #7 (Manual run by Chris Gianelloni) Distro Tests - MapR 5.2 4 mins
Successful BatchAggregatorTest test History
Failing since build #5 (Rebuilt by Nishith Nand) Distro Tests - CDH 5.10 6 mins
Successful BatchAggregatorTest test History
Failing since build #7 (Manual run by Chris Gianelloni) Distro Tests - MapR 5.2 6 mins
Successful BatchCubeSinkTest test History
Failing since build #5 (Rebuilt by Nishith Nand) Distro Tests - CDH 5.10 3 mins
Successful BatchCubeSinkTest test History
Failing since build #7 (Manual run by Chris Gianelloni) Distro Tests - MapR 5.2 2 mins
Successful BatchJoinerTest testJoinerMR History
Failing since build #5 (Rebuilt by Nishith Nand) Distro Tests - CDH 5.10 7 mins
Successful BatchJoinerTest testJoinerSpark History
Failing since build #5 (Rebuilt by Nishith Nand) Distro Tests - CDH 5.10 5 mins
Successful ETLMapReduceTest testKVToKV History
Failing since build #5 (Rebuilt by Nishith Nand) Distro Tests - CDH 5.10 3 mins
Successful ETLMapReduceTest testDAGSchemaChanges History
Failing since build #5 (Rebuilt by Nishith Nand) Distro Tests - CDH 5.10 3 mins
Successful ETLMapReduceTest testDAGInvalidSchema History
Failing since build #5 (Rebuilt by Nishith Nand) Distro Tests - CDH 5.10 5 secs
Successful ETLMapReduceTest testDAG History
Failing since build #5 (Rebuilt by Nishith Nand) Distro Tests - CDH 5.10 3 mins
Successful ETLMapReduceTest testTableToTableWithValidations History
Failing since build #5 (Rebuilt by Nishith Nand) Distro Tests - CDH 5.10 3 mins
Successful ETLMapReduceTest testTableToTableWithValidations History
Failing since build #7 (Manual run by Chris Gianelloni) Distro Tests - MapR 5.2 3 mins
Successful ETLMapReduceTest testKVToKV History
Failing since build #7 (Manual run by Chris Gianelloni) Distro Tests - MapR 5.2 3 mins
Successful ETLMapReduceTest testDAGSchemaChanges History
Failing since build #7 (Manual run by Chris Gianelloni) Distro Tests - MapR 5.2 3 mins
Successful ETLMapReduceTest testDAGInvalidSchema History
Failing since build #7 (Manual run by Chris Gianelloni) Distro Tests - MapR 5.2 6 secs
Successful ETLMapReduceTest testDAG History
Failing since build #7 (Manual run by Chris Gianelloni) Distro Tests - MapR 5.2 3 mins
Successful ExcelInputReaderTest testExcelReaderReprocessFalse History
Failing since build #5 (Rebuilt by Nishith Nand) Distro Tests - CDH 5.10 3 mins
Successful ExcelInputReaderTest testExcelReader History
Failing since build #5 (Rebuilt by Nishith Nand) Distro Tests - CDH 5.10 3 mins
Successful ExcelInputReaderTest testExcelReaderReprocessFalse History
Failing since build #7 (Manual run by Chris Gianelloni) Distro Tests - MapR 5.2 3 mins
Successful ExcelInputReaderTest testExcelReader History
Failing since build #7 (Manual run by Chris Gianelloni) Distro Tests - MapR 5.2 2 mins
Successful NormalizeTest testNormalizeWithEmptyAttributeValue History
Failing since build #5 (Rebuilt by Nishith Nand) Distro Tests - CDH 5.10 3 mins
Successful NormalizeTest testNormalize History
Failing since build #5 (Rebuilt by Nishith Nand) Distro Tests - CDH 5.10 3 mins
Successful NormalizeTest testNormalizeWithEmptyAttributeValue History
Failing since build #7 (Manual run by Chris Gianelloni) Distro Tests - MapR 5.2 3 mins
Successful NormalizeTest testNormalize History
Failing since build #7 (Manual run by Chris Gianelloni) Distro Tests - MapR 5.2 3 mins
Successful RowDenormalizerTest test History
Failing since build #5 (Rebuilt by Nishith Nand) Distro Tests - CDH 5.10 3 mins
Successful RowDenormalizerTest test History
Failing since build #7 (Manual run by Chris Gianelloni) Distro Tests - MapR 5.2 3 mins
Successful ValueMapperTest test History
Failing since build #5 (Rebuilt by Nishith Nand) Distro Tests - CDH 5.10 3 mins
Successful ValueMapperTest test History
Failing since build #7 (Manual run by Chris Gianelloni) Distro Tests - MapR 5.2 3 mins
Successful XMLReaderTest testInvalidNodePathWithMoveAction History
Failing since build #5 (Rebuilt by Nishith Nand) Distro Tests - CDH 5.10 3 mins
Successful XMLReaderTest testPatternWithDeleteAction History
Failing since build #5 (Rebuilt by Nishith Nand) Distro Tests - CDH 5.10 3 mins
Successful XMLReaderTest testPreProcessingRequired History
Failing since build #5 (Rebuilt by Nishith Nand) Distro Tests - CDH 5.10 3 mins
Successful XMLReaderTest testInvalidPatternWithDeleteAction History
Failing since build #5 (Rebuilt by Nishith Nand) Distro Tests - CDH 5.10 3 mins
Successful XMLReaderTest testPreProcessingNotRequired History
Failing since build #5 (Rebuilt by Nishith Nand) Distro Tests - CDH 5.10 3 mins
Successful XMLReaderTest testInvalidNodePathWithMoveAction History
Failing since build #7 (Manual run by Chris Gianelloni) Distro Tests - MapR 5.2 3 mins
Successful XMLReaderTest testPatternWithDeleteAction History
Failing since build #7 (Manual run by Chris Gianelloni) Distro Tests - MapR 5.2 3 mins
Successful XMLReaderTest testPreProcessingRequired History
Failing since build #7 (Manual run by Chris Gianelloni) Distro Tests - MapR 5.2 3 mins
Successful XMLReaderTest testInvalidPatternWithDeleteAction History
Failing since build #7 (Manual run by Chris Gianelloni) Distro Tests - MapR 5.2 2 mins
Successful XMLReaderTest testPreProcessingNotRequired History
Failing since build #7 (Manual run by Chris Gianelloni) Distro Tests - MapR 5.2 3 mins

JIRA issues

IssueDescriptionStatus
Unknown Issue TypeCDAP-12303Could not obtain issue details from JIRA