Build #23

Build: #23 failed Manual run by Derek Wood

Build result summary

Details

Completed
Duration
283 minutes
Labels
None
Revisions
CDAP Integration Tests
1d34669393681cda13e223b713d7a35f23db6033 1d34669393681cda13e223b713d7a35f23db6033
Coopr-internal
ab3a6f637b1b4b5cfa4bfbacc968d648e3c06da1 ab3a6f637b1b4b5cfa4bfbacc968d648e3c06da1
Total tests
63
Failing since
#8 (Manual run by Derek Wood)

Responsible

Code commits

Coopr-internal
Author Commit Message Commit date
Derek Wood Derek Wood ab3a6f637b1b4b5cfa4bfbacc968d648e3c06da1 ab3a6f637b1b4b5cfa4bfbacc968d648e3c06da1 Merge pull request #508 from caskdata/fix/update-ajai-ssh-key
Adds newly generated ssh key for ajai
Ajai Narayan Ajai Narayan 211ce7e0eea6dd73d2ba1035390b4f022cff499c 211ce7e0eea6dd73d2ba1035390b4f022cff499c Adds newly generated ssh key for ajai

Configuration changes

Plan configuration has changed since the last successful build. See the plan audit log for more details.

Tests

Existing test failures 4
Status Test Failing since View job Duration
java.lang.AssertionError: null
	at org.junit.Assert.fail(Assert.java:86)
	at org.junit.Assert.assertTrue(Assert.java:41)
	at org.junit.Assert.assertTrue(Assert.java:52)
	at co.cask.cdap.operations.OperationalStatsTest.getInfoStats(OperationalStatsTest.java:195)
	at co.cask.cdap.operations.OperationalStatsTest.testYarnStats(OperationalStatsTest.java:73)
java.lang.AssertionError: null
	at org.junit.Assert.fail(Assert.java:86)
	at org.junit.Assert.assertTrue(Assert.java:41)
	at org.junit.Assert.assertTrue(Assert.java:52)
	at co.cask.cdap.operations.OperationalStatsTest.getInfoStats(OperationalStatsTest.java:195)
	at co.cask.cdap.operations.OperationalStatsTest.testHDFSStats(OperationalStatsTest.java:50)
java.lang.AssertionError: null
	at org.junit.Assert.fail(Assert.java:86)
	at org.junit.Assert.assertTrue(Assert.java:41)
	at org.junit.Assert.assertTrue(Assert.java:52)
	at co.cask.cdap.operations.OperationalStatsTest.getInfoStats(OperationalStatsTest.java:195)
	at co.cask.cdap.operations.OperationalStatsTest.testHBaseStats(OperationalStatsTest.java:119)
java.lang.AssertionError: null
	at org.junit.Assert.fail(Assert.java:86)
	at org.junit.Assert.assertTrue(Assert.java:41)
	at org.junit.Assert.assertTrue(Assert.java:52)
	at co.cask.cdap.operations.OperationalStatsTest.getInfoStats(OperationalStatsTest.java:195)
	at co.cask.cdap.operations.OperationalStatsTest.testCDAPStats(OperationalStatsTest.java:145)