Build #40

Build: #40 failed Scheduled with changes by Chris Gianelloni

Stages & jobs

  1. Variables

  2. Spinup and Test

Build result summary

Details

Completed
Duration
171 minutes
Labels
None
Revisions
CDAP Integration Tests
2147f34c3bbe52e02bab8129b1ee01a8d6e51403 2147f34c3bbe52e02bab8129b1ee01a8d6e51403
Coopr-internal
54fddfe181a7bd05b5e05246c6cfdb985d03cf15 54fddfe181a7bd05b5e05246c6cfdb985d03cf15
Total tests
116
Failing since
#9 (Scheduled with changes by Chris Gianelloni and Derek Wood)

Responsible

This build has been failing since #9
No one has taken responsibility

Code commits

Coopr-internal
Author Commit Message Commit date
Chris Gianelloni Chris Gianelloni 54fddfe181a7bd05b5e05246c6cfdb985d03cf15 54fddfe181a7bd05b5e05246c6cfdb985d03cf15 Merge pull request #568 from caskdata/feature/ambari-cluster-size
Increase default size on Ambari clusters
Chris Gianelloni Chris Gianelloni 2d25f0562ac745181eb3da768fb8191b06db3e63 2d25f0562ac745181eb3da768fb8191b06db3e63 Increase default size on Ambari clusters
Chris Gianelloni Chris Gianelloni a38ecef99c73ab1cc43f0320a5d887ddaca23e4e a38ecef99c73ab1cc43f0320a5d887ddaca23e4e Merge pull request #557 from caskdata/feature/mssql-docker
Support microsoft/mssql-server-linux Docker container
Chris Gianelloni Chris Gianelloni 50a55baa48a68a3d2bcc5f100192939ae697086d m 50a55baa48a68a3d2bcc5f100192939ae697086d Support microsoft/mssql-server-linux Docker container

Configuration changes

Plan configuration has changed since the last successful build. See the plan audit log for more details.

Tests

New test failures 2
Status Test View job Duration
Collapse Failed PurchaseAudiTest test History
Ambari - HDP 2.4 29 secs
java.lang.AssertionError: expected:<2> but was:<1>
	at org.junit.Assert.fail(Assert.java:88)
	at org.junit.Assert.failNotEquals(Assert.java:743)
	at org.junit.Assert.assertEquals(Assert.java:118)
	at org.junit.Assert.assertEquals(Assert.java:555)
	at org.junit.Assert.assertEquals(Assert.java:542)
	at co.cask.cdap.apps.purchase.PurchaseAudiTest.test(PurchaseAudiTest.java:83)
Collapse Failed PurchaseAudiTest test History
Ambari - HDP 2.5 30 secs
java.lang.AssertionError: expected:<2> but was:<1>
	at org.junit.Assert.fail(Assert.java:88)
	at org.junit.Assert.failNotEquals(Assert.java:743)
	at org.junit.Assert.assertEquals(Assert.java:118)
	at org.junit.Assert.assertEquals(Assert.java:555)
	at org.junit.Assert.assertEquals(Assert.java:542)
	at co.cask.cdap.apps.purchase.PurchaseAudiTest.test(PurchaseAudiTest.java:83)
Existing test failures 3
Status Test Failing since View job Duration
java.lang.AssertionError: All traffic should be routed to service v1 but service v2 is also reached.
	at org.junit.Assert.fail(Assert.java:88)
	at co.cask.cdap.apps.ApplicationVersionTest.testRouteConfig(ApplicationVersionTest.java:211)
java.util.concurrent.TimeoutException: Timeout occurred. Expected true but found false.
	at co.cask.cdap.common.utils.Tasks.waitFor(Tasks.java:70)
	at co.cask.cdap.common.utils.Tasks.waitFor(Tasks.java:91)
	at co.cask.cdap.common.utils.Tasks.waitFor(Tasks.java:130)
	at co.cask.cdap.test.AbstractProgramManager.waitForRuns(AbstractProgramManager.java:90)
	at co.cask.cdap.test.AbstractProgramManager.waitForRun(AbstractProgramManager.java:84)
	at co.cask.cdap.apps.spark.sparkpagerank.SparkPageRankAppTest.test(SparkPageRankAppTest.java:154)
java.util.concurrent.TimeoutException: Timeout occurred. Expected true but found false.
	at co.cask.cdap.common.utils.Tasks.waitFor(Tasks.java:70)
	at co.cask.cdap.common.utils.Tasks.waitFor(Tasks.java:91)
	at co.cask.cdap.common.utils.Tasks.waitFor(Tasks.java:130)
	at co.cask.cdap.test.AbstractProgramManager.waitForRuns(AbstractProgramManager.java:90)
	at co.cask.cdap.test.AbstractProgramManager.waitForRun(AbstractProgramManager.java:84)
	at co.cask.cdap.apps.spark.sparkpagerank.SparkPageRankAppTest.test(SparkPageRankAppTest.java:154)
Fixed tests 1
Status Test Failing since View job Duration
Successful ApplicationVersionTest testRouteConfig History
Failing since build #38 (Scheduled with changes by Ali Anwar) Ambari - HDP 2.4 1 min