Build #256

Run integration tests against a custom cluster

Build: #256 failed Manual run by Terence Yim

Build result summary

Details

Completed
Duration
191 minutes
Flags
Custom build
Labels
None
Agent
bamboo-agent15
Revision
6ea482c29f0934acfc7f71fd2424896d78d4a1ef 6ea482c29f0934acfc7f71fd2424896d78d4a1ef
Total tests
58
Failing since
#253 (Manual run by Gokul Gunasekaran)

Responsible

Code commits

Author Commit Message Commit date
Sreevatsan Raman Sreevatsan Raman 6ea482c29f0934acfc7f71fd2424896d78d4a1ef 6ea482c29f0934acfc7f71fd2424896d78d4a1ef Merge pull request #712 from caskdata/feature/cdap-9195-fix-readless-increment-test
[CDAP-9195] Turn off speculative execution for ReadlessIncrementTest
Andreas Neumann Andreas Neumann bec91bb25a12cb2076fa008dd1810f6086686b62 bec91bb25a12cb2076fa008dd1810f6086686b62 [CDAP-9195] Turn off speculative execution for ReadlessIncrementTest
Derek Wood Derek Wood 60e908c41d25785a545eb92052321a9235e5cc11 60e908c41d25785a545eb92052321a9235e5cc11 Merge pull request #709 from caskdata/feature/itn-cm-auth-configs
use CM parameter name for consistent merging of json
Derek Wood Derek Wood ee98f4acb6e32c6fac5c2353a8e86aec25e02013 ee98f4acb6e32c6fac5c2353a8e86aec25e02013 use CM parameter name for consistent merging of json
Derek Wood Derek Wood 9dbc57adb6035c4100fc5a9d5acaae401f10e1d0 9dbc57adb6035c4100fc5a9d5acaae401f10e1d0 Merge pull request #708 from caskdata/feature/itn-cm-auth-configs
run itn CM authorization tests as generic user

Configuration changes

Plan configuration has changed since the last successful build. See the plan audit log for more details.

Tests

New test failures 2
Status Test View job Duration
Collapse Failed WorkflowTest testKMeans History
Default Job 15 mins
java.util.concurrent.TimeoutException: Timeout occurred. Expected true but found false.
	at co.cask.cdap.common.utils.Tasks.waitFor(Tasks.java:70)
	at co.cask.cdap.common.utils.Tasks.waitFor(Tasks.java:91)
	at co.cask.cdap.common.utils.Tasks.waitFor(Tasks.java:130)
	at co.cask.cdap.test.AbstractProgramManager.waitForRuns(AbstractProgramManager.java:90)
	at co.cask.cdap.apps.workflow.WorkflowTest.testWorkflow(WorkflowTest.java:181)
	at co.cask.cdap.apps.workflow.WorkflowTest.testKMeans(WorkflowTest.java:111)
Collapse Failed WorkflowTest testLDA History
Default Job < 1 sec
java.util.concurrent.TimeoutException: Timeout occurred. Expected true but found false.
	at co.cask.cdap.common.utils.Tasks.waitFor(Tasks.java:70)
	at co.cask.cdap.common.utils.Tasks.waitFor(Tasks.java:91)
	at co.cask.cdap.common.utils.Tasks.waitFor(Tasks.java:130)
	at co.cask.cdap.test.AbstractProgramManager.waitForRuns(AbstractProgramManager.java:90)
	at co.cask.cdap.apps.workflow.WorkflowTest.testWorkflow(WorkflowTest.java:181)
	at co.cask.cdap.apps.workflow.WorkflowTest.testLDA(WorkflowTest.java:99)
Existing test failures 1
Status Test Failing since View job Duration
java.util.concurrent.TimeoutException: Timeout occurred. Expected true but found false.
	at co.cask.cdap.common.utils.Tasks.waitFor(Tasks.java:70)
	at co.cask.cdap.common.utils.Tasks.waitFor(Tasks.java:91)
	at co.cask.cdap.app.etl.realtime.DataStreamsTest.testKafkaAggregatorTable(DataStreamsTest.java:158)
Fixed tests 13
Status Test Failing since View job Duration
Successful BatchJoinerTest testJoinerMR History
Failing since build #255 (Manual run by Ali Anwar) Default Job 7 mins
Successful BatchJoinerTest testJoinerSpark History
Failing since build #255 (Manual run by Ali Anwar) Default Job 4 mins
Successful ETLMapReduceTest testTableToTableWithValidations History
Failing since build #255 (Manual run by Ali Anwar) Default Job 3 mins
Successful ETLMapReduceTest testKVToKV History
Failing since build #255 (Manual run by Ali Anwar) Default Job 3 mins
Successful ETLMapReduceTest testDAGSchemaChanges History
Failing since build #255 (Manual run by Ali Anwar) Default Job 3 mins
Successful ETLMapReduceTest testDAGInvalidSchema History
Failing since build #255 (Manual run by Ali Anwar) Default Job 5 secs
Successful ETLMapReduceTest testDAG History
Failing since build #255 (Manual run by Ali Anwar) Default Job 2 mins
Successful ExcelInputReaderTest testExcelReaderReprocessFalse History
Failing since build #255 (Manual run by Ali Anwar) Default Job 3 mins
Successful ExcelInputReaderTest testExcelReader History
Failing since build #255 (Manual run by Ali Anwar) Default Job 2 mins
Successful DatasetTest test History
Failing since build #255 (Manual run by Ali Anwar) Default Job 1 min
Successful ExploreTest test History
Failing since build #255 (Manual run by Ali Anwar) Default Job < 1 sec
Successful ExploreTest testSubqueryInWhereClause History
Failing since build #255 (Manual run by Ali Anwar) Default Job 2 mins
Successful FileSetTest test History
Failing since build #255 (Manual run by Ali Anwar) Default Job 1 min

JIRA issues

IssueDescriptionStatus
Unknown Issue TypeCDAP-7071Could not obtain issue details from JIRA
Unknown Issue TypeCDAP-7632Could not obtain issue details from JIRA
Unknown Issue TypeCDAP-8258Could not obtain issue details from JIRA
Unknown Issue TypeCDAP-9195Could not obtain issue details from JIRA