Build #70

Tests impersonation using ITN test cases

Build: #70 failed Scheduled with changes by Russ Savage <russ@cask.co> and Sreevatsan Raman

Build result summary

Details

Completed
Duration
297 minutes
Labels
None
Agent
bamboo-agent12
Revision
0d5c72e4186bbbfe44f3d2cbc80a051bfecbbe64 0d5c72e4186bbbfe44f3d2cbc80a051bfecbbe64
Total tests
60
Failing since
#24 (Scheduled – )

Responsible

This build has been failing since #24
No one has taken responsibility

Code commits

Author Commit Message Commit date
Sreevatsan Raman Sreevatsan Raman 0d5c72e4186bbbfe44f3d2cbc80a051bfecbbe64 0d5c72e4186bbbfe44f3d2cbc80a051bfecbbe64 Merge pull request #739 from caskdata/bugfix/fix-xml-tests
adding globbing to xml tests
Russ Savage &lt;russ@cask.co&gt; Russ Savage <russ@cask.co> b71a060557c88fe70c92c7afea9bd89ce24c2922 b71a060557c88fe70c92c7afea9bd89ce24c2922 fixing itn tests for xml
Russ Savage &lt;russ@cask.co&gt; Russ Savage <russ@cask.co> 115610749e14b2aed0664917e59e4f5d4a8b6bc9 115610749e14b2aed0664917e59e4f5d4a8b6bc9 adding globbing to xml tests

Configuration changes

Plan configuration has changed since the last successful build. See the plan audit log for more details.

Tests

New test failures 13
Status Test View job Duration
Collapse Failed StreamTPFSWithProjectionTest testStreamTPFSWithProjection History
Distro Tests - CDH 5.5 10 mins
java.util.concurrent.TimeoutException: Timeout occurred. Expected true but found false.
	at co.cask.cdap.common.utils.Tasks.waitFor(Tasks.java:70)
	at co.cask.cdap.common.utils.Tasks.waitFor(Tasks.java:91)
	at co.cask.cdap.common.utils.Tasks.waitFor(Tasks.java:130)
	at co.cask.cdap.test.AbstractProgramManager.waitForRuns(AbstractProgramManager.java:90)
	at co.cask.cdap.test.AbstractProgramManager.waitForRun(AbstractProgramManager.java:84)
	at co.cask.cdap.app.etl.StreamTPFSWithProjectionTest.testStreamTPFSWithProjection(StreamTPFSWithProjectionTest.java:88)
Collapse Failed BatchAggregatorTest test History
Distro Tests - CDH 5.5 16 mins
java.util.concurrent.TimeoutException: Timeout occurred. Expected true but found false.
	at co.cask.cdap.common.utils.Tasks.waitFor(Tasks.java:70)
	at co.cask.cdap.common.utils.Tasks.waitFor(Tasks.java:91)
	at co.cask.cdap.common.utils.Tasks.waitFor(Tasks.java:130)
	at co.cask.cdap.test.AbstractProgramManager.waitForRuns(AbstractProgramManager.java:90)
	at co.cask.cdap.test.AbstractProgramManager.waitForRun(AbstractProgramManager.java:84)
	at co.cask.cdap.app.etl.batch.BatchAggregatorTest.test(BatchAggregatorTest.java:162)
Collapse Failed BatchJoinerTest testJoinerMR History
Distro Tests - CDH 5.5 < 1 sec
java.util.concurrent.TimeoutException: Timeout occurred. Expected true but found false.
	at co.cask.cdap.common.utils.Tasks.waitFor(Tasks.java:70)
	at co.cask.cdap.common.utils.Tasks.waitFor(Tasks.java:91)
	at co.cask.cdap.common.utils.Tasks.waitFor(Tasks.java:130)
	at co.cask.cdap.test.AbstractProgramManager.waitForRuns(AbstractProgramManager.java:90)
	at co.cask.cdap.test.AbstractProgramManager.waitForRun(AbstractProgramManager.java:84)
	at co.cask.cdap.app.etl.batch.BatchJoinerTest.testJoiner(BatchJoinerTest.java:225)
	at co.cask.cdap.app.etl.batch.BatchJoinerTest.testJoinerMR(BatchJoinerTest.java:88)
Collapse Failed BatchJoinerTest testJoinerSpark History
Distro Tests - CDH 5.5 < 1 sec
java.util.concurrent.TimeoutException: Timeout occurred. Expected true but found false.
	at co.cask.cdap.common.utils.Tasks.waitFor(Tasks.java:70)
	at co.cask.cdap.common.utils.Tasks.waitFor(Tasks.java:91)
	at co.cask.cdap.common.utils.Tasks.waitFor(Tasks.java:130)
	at co.cask.cdap.test.AbstractProgramManager.waitForRuns(AbstractProgramManager.java:90)
	at co.cask.cdap.test.AbstractProgramManager.waitForRun(AbstractProgramManager.java:84)
	at co.cask.cdap.app.etl.batch.BatchJoinerTest.testJoiner(BatchJoinerTest.java:225)
	at co.cask.cdap.app.etl.batch.BatchJoinerTest.testJoinerSpark(BatchJoinerTest.java:102)
Collapse Failed ETLMapReduceTest testTableToTableWithValidations History
Distro Tests - CDH 5.5 6 mins
java.util.concurrent.TimeoutException: Timeout occurred. Expected true but found false.
	at co.cask.cdap.common.utils.Tasks.waitFor(Tasks.java:70)
	at co.cask.cdap.common.utils.Tasks.waitFor(Tasks.java:91)
	at co.cask.cdap.common.utils.Tasks.waitFor(Tasks.java:130)
	at co.cask.cdap.test.AbstractProgramManager.waitForRuns(AbstractProgramManager.java:90)
	at co.cask.cdap.test.AbstractProgramManager.waitForRun(AbstractProgramManager.java:84)
	at co.cask.cdap.app.etl.batch.ETLMapReduceTest.testTableToTableWithValidations(ETLMapReduceTest.java:606)
Collapse Failed ETLMapReduceTest testDAGSchemaChanges History
Distro Tests - CDH 5.5 6 mins
java.util.concurrent.TimeoutException: Timeout occurred. Expected true but found false.
	at co.cask.cdap.common.utils.Tasks.waitFor(Tasks.java:70)
	at co.cask.cdap.common.utils.Tasks.waitFor(Tasks.java:91)
	at co.cask.cdap.common.utils.Tasks.waitFor(Tasks.java:130)
	at co.cask.cdap.test.AbstractProgramManager.waitForRuns(AbstractProgramManager.java:90)
	at co.cask.cdap.test.AbstractProgramManager.waitForRun(AbstractProgramManager.java:84)
	at co.cask.cdap.app.etl.batch.ETLMapReduceTest.testDAGSchemaChanges(ETLMapReduceTest.java:447)
Collapse Failed ETLMapReduceTest testDAG History
Distro Tests - CDH 5.5 6 mins
java.util.concurrent.TimeoutException: Timeout occurred. Expected true but found false.
	at co.cask.cdap.common.utils.Tasks.waitFor(Tasks.java:70)
	at co.cask.cdap.common.utils.Tasks.waitFor(Tasks.java:91)
	at co.cask.cdap.common.utils.Tasks.waitFor(Tasks.java:130)
	at co.cask.cdap.test.AbstractProgramManager.waitForRuns(AbstractProgramManager.java:90)
	at co.cask.cdap.test.AbstractProgramManager.waitForRun(AbstractProgramManager.java:84)
	at co.cask.cdap.app.etl.batch.ETLMapReduceTest.testDAG(ETLMapReduceTest.java:194)
Collapse Failed ExploreTest test History
Distro Tests - CDH 5.5 1 min
java.util.concurrent.ExecutionException: co.cask.cdap.explore.service.ExploreException: Cannot execute query. Reason: Response code: 400, message: 'Bad Request', body: '[SQLState 42S02] Error while compiling statement: FAILED: SemanticException [Error 10001]: Line 1:45 Table not found 'dataset_wordcounts''
	at com.google.common.util.concurrent.AbstractFuture$Sync.getValue(AbstractFuture.java:294)
	at com.google.common.util.concurrent.AbstractFuture$Sync.get(AbstractFuture.java:281)
	at com.google.common.util.concurrent.AbstractFuture.get(AbstractFuture.java:116)
	at co.cask.cdap.apps.explore.ExploreTest.testEqualityJoin(ExploreTest.java:257)
	at co.cask.cdap.apps.explore.ExploreTest.test(ExploreTest.java:71)
Caused by: co.cask.cdap.explore.service.ExploreException: Cannot execute query. Reason: Response code: 400, message: 'Bad Request', body: '[SQLState 42S02] Error while compiling statement: FAILED: SemanticException [Error 10001]: Line 1:45 Table not found 'dataset_wordcounts''
	at co.cask.cdap.explore.client.ExploreHttpClient.execute(ExploreHttpClient.java:264)
(14 more lines...)
Collapse Failed ExploreTest testSubqueryInWhereClause History
Distro Tests - CDH 5.5 1 min
java.util.concurrent.ExecutionException: co.cask.cdap.explore.service.ExploreException: Cannot execute query. Reason: Response code: 400, message: 'Bad Request', body: '[SQLState 42S02] Error while compiling statement: FAILED: SemanticException [Error 10001]: Line 1:14 Table not found 'dataset_wordcounts''
	at com.google.common.util.concurrent.AbstractFuture$Sync.getValue(AbstractFuture.java:294)
	at com.google.common.util.concurrent.AbstractFuture$Sync.get(AbstractFuture.java:281)
	at com.google.common.util.concurrent.AbstractFuture.get(AbstractFuture.java:116)
	at co.cask.cdap.apps.explore.ExploreTest.testSubqueryInWhereClause(ExploreTest.java:572)
Caused by: co.cask.cdap.explore.service.ExploreException: Cannot execute query. Reason: Response code: 400, message: 'Bad Request', body: '[SQLState 42S02] Error while compiling statement: FAILED: SemanticException [Error 10001]: Line 1:14 Table not found 'dataset_wordcounts''
	at co.cask.cdap.explore.client.ExploreHttpClient.execute(ExploreHttpClient.java:264)
	at co.cask.cdap.explore.client.AbstractExploreClient.execute(AbstractExploreClient.java:66)
(13 more lines...)
Collapse Failed PartitionCorrectorTest test History
Distro Tests - CDH 5.5 44 secs
java.io.IOException: 500: Exception occurred while handling request: Cannot add partition with key {key=0} to dataset dataset:alice.pfs. Reason: Response code: 500, message: 'Internal Server Error', body: 'Error while compiling statement: FAILED: SemanticException [Error 10001]: Table not found dataset_pfs'
	at co.cask.cdap.client.util.RESTClient.execute(RESTClient.java:132)
	at co.cask.cdap.client.util.RESTClient.execute(RESTClient.java:69)
	at co.cask.cdap.apps.fileset.PartitionCorrectorTest.test(PartitionCorrectorTest.java:65)
Collapse Failed PartitionedFileSetUpdateTest test History
Distro Tests - CDH 5.5 43 secs
java.io.IOException: 500: Exception occurred while handling request: Cannot add partition with key {key=1} to dataset dataset:alice.pfs. Reason: Response code: 500, message: 'Internal Server Error', body: 'Error while compiling statement: FAILED: SemanticException [Error 10001]: Table not found dataset_pfs'
	at co.cask.cdap.client.util.RESTClient.execute(RESTClient.java:132)
	at co.cask.cdap.client.util.RESTClient.execute(RESTClient.java:69)
	at co.cask.cdap.apps.fileset.PartitionedFileSetUpdateTest.test(PartitionedFileSetUpdateTest.java:74)
Collapse Failed PurchaseMetadataTest testSearchUsingSystemMetadata History
Distro Tests - CDH 5.5 23 secs
java.io.IOException: 500: Cannot enable explore on stream purchaseStream with table stream_purchasestream_view. Reason: Response code: 500, message: 'Internal Server Error', body: 'Database does not exist: cdap_alice'
	at co.cask.cdap.client.util.RESTClient.execute(RESTClient.java:132)
	at co.cask.cdap.client.util.RESTClient.execute(RESTClient.java:69)
	at co.cask.cdap.client.StreamViewClient.createOrUpdate(StreamViewClient.java:96)
	at co.cask.cdap.apps.metadata.PurchaseMetadataTest.assertDataEntitySearch(PurchaseMetadataTest.java:505)
	at co.cask.cdap.apps.metadata.PurchaseMetadataTest.testSearchUsingSystemMetadata(PurchaseMetadataTest.java:324)
Collapse Failed TransactionTimeoutTest testFlowletTimeouts History
Distro Tests - CDH 5.5 2 mins
java.sql.SQLException: co.cask.cdap.explore.service.ExploreException: Cannot execute query. Reason: Response code: 400, message: 'Bad Request', body: '[SQLState 42S02] Error while compiling statement: FAILED: SemanticException [Error 10001]: Line 1:55 Table not found 'checks''
	at co.cask.cdap.explore.jdbc.ExploreStatement.execute(ExploreStatement.java:123)
	at co.cask.cdap.explore.jdbc.ExplorePreparedStatement.execute(ExplorePreparedStatement.java:76)
	at co.cask.cdap.explore.jdbc.ExplorePreparedStatement.executeQuery(ExplorePreparedStatement.java:84)
	at co.cask.cdap.apps.transaction.TransactionTimeoutTest.validateCheckedValues(TransactionTimeoutTest.java:97)
	at co.cask.cdap.apps.transaction.TransactionTimeoutTest.testFlowletTimeouts(TransactionTimeoutTest.java:73)
Caused by: co.cask.cdap.explore.service.ExploreException: Cannot execute query. Reason: Response code: 400, message: 'Bad Request', body: '[SQLState 42S02] Error while compiling statement: FAILED: SemanticException [Error 10001]: Line 1:55 Table not found 'checks''
	at co.cask.cdap.explore.client.ExploreHttpClient.execute(ExploreHttpClient.java:264)
(14 more lines...)
Existing test failures 1
Status Test Failing since View job Duration
java.lang.AssertionError: Expected an ExecutionException to be thrown
	at org.junit.Assert.fail(Assert.java:88)
	at co.cask.cdap.security.AppImpersonationTest.test(AppImpersonationTest.java:140)
Fixed tests 2
Status Test Failing since View job Duration
Successful XMLReaderTest testInvalidPatternWithDeleteAction History
Failing since build #68 (Scheduled) Distro Tests - CDH 5.5 3 mins
Successful XMLReaderTest testPatternWithDeleteAction History
Failing since build #68 (Scheduled) Distro Tests - CDH 5.5 3 mins