Build #250

DISABLED - please use https://builds.cask.co/browse/IT-IIT

Build: #250 failed Scheduled

Build result summary

Details

Completed
Duration
418 minutes
Labels
None
Agent
bamboo-agent18
Revision
54e7c053ab8709ebfb52bdc825452d9302fa42a9 54e7c053ab8709ebfb52bdc825452d9302fa42a9
Total tests
65
Failing since
#239 (Scheduled – )

Responsible

This build has been failing since #239
No one has taken responsibility

Tests

New test failures 1
Status Test View job Duration
Collapse Failed PurchaseMetadataTest testLineage History
Distro Tests - CDH 5.5 < 1 sec
java.util.concurrent.ExecutionException: java.lang.RuntimeException: java.io.IOException: 503: Service 'transaction' is not available. Please wait until it is up and running.
	at co.cask.cdap.client.util.RESTClient.execute(RESTClient.java:132)
	at co.cask.cdap.client.util.RESTClient.execute(RESTClient.java:74)
	at co.cask.cdap.client.ProgramClient.getProgramRuns(ProgramClient.java:871)
	at co.cask.cdap.test.remote.RemoteApplicationManager.getHistory(RemoteApplicationManager.java:170)
	at co.cask.cdap.test.AbstractProgramManager.getHistory(AbstractProgramManager.java:144)
	at co.cask.cdap.test.AbstractProgramManager$1.call(AbstractProgramManager.java:93)
	at co.cask.cdap.test.AbstractProgramManager$1.call(AbstractProgramManager.java:90)
(6 more lines...)
Existing test failures 29
Status Test Failing since View job Duration
java.util.concurrent.TimeoutException: Timeout occurred. Expected true but found false.
	at co.cask.cdap.common.utils.Tasks.waitFor(Tasks.java:70)
	at co.cask.cdap.common.utils.Tasks.waitFor(Tasks.java:91)
	at co.cask.cdap.app.etl.ETLTestBase.setup(ETLTestBase.java:82)
	at sun.reflect.NativeMethodAccessorImpl.invoke0(Native Method)
	at sun.reflect.NativeMethodAccessorImpl.invoke(NativeMethodAccessorImpl.java:57)
	at sun.reflect.DelegatingMethodAccessorImpl.invoke(DelegatingMethodAccessorImpl.java:43)
	at java.lang.reflect.Method.invoke(Method.java:606)
(47 more lines...)
java.util.concurrent.TimeoutException: Timeout occurred. Expected true but found false.
	at co.cask.cdap.common.utils.Tasks.waitFor(Tasks.java:70)
	at co.cask.cdap.common.utils.Tasks.waitFor(Tasks.java:91)
	at co.cask.cdap.app.etl.ETLTestBase.setup(ETLTestBase.java:82)
	at sun.reflect.GeneratedMethodAccessor5.invoke(Unknown Source)
	at sun.reflect.DelegatingMethodAccessorImpl.invoke(DelegatingMethodAccessorImpl.java:43)
	at java.lang.reflect.Method.invoke(Method.java:606)
	at org.junit.runners.model.FrameworkMethod$1.runReflectiveCall(FrameworkMethod.java:47)
(46 more lines...)
java.util.concurrent.TimeoutException: Timeout occurred. Expected true but found false.
	at co.cask.cdap.common.utils.Tasks.waitFor(Tasks.java:70)
	at co.cask.cdap.common.utils.Tasks.waitFor(Tasks.java:91)
	at co.cask.cdap.app.etl.ETLTestBase.setup(ETLTestBase.java:82)
	at sun.reflect.NativeMethodAccessorImpl.invoke0(Native Method)
	at sun.reflect.NativeMethodAccessorImpl.invoke(NativeMethodAccessorImpl.java:57)
	at sun.reflect.DelegatingMethodAccessorImpl.invoke(DelegatingMethodAccessorImpl.java:43)
	at java.lang.reflect.Method.invoke(Method.java:606)
(47 more lines...)
java.util.concurrent.TimeoutException: Timeout occurred. Expected true but found false.
	at co.cask.cdap.common.utils.Tasks.waitFor(Tasks.java:70)
	at co.cask.cdap.common.utils.Tasks.waitFor(Tasks.java:91)
	at co.cask.cdap.app.etl.ETLTestBase.setup(ETLTestBase.java:82)
	at sun.reflect.NativeMethodAccessorImpl.invoke0(Native Method)
	at sun.reflect.NativeMethodAccessorImpl.invoke(NativeMethodAccessorImpl.java:57)
	at sun.reflect.DelegatingMethodAccessorImpl.invoke(DelegatingMethodAccessorImpl.java:43)
	at java.lang.reflect.Method.invoke(Method.java:606)
(47 more lines...)
java.util.concurrent.TimeoutException: Timeout occurred. Expected true but found false.
	at co.cask.cdap.common.utils.Tasks.waitFor(Tasks.java:70)
	at co.cask.cdap.common.utils.Tasks.waitFor(Tasks.java:91)
	at co.cask.cdap.app.etl.ETLTestBase.setup(ETLTestBase.java:82)
	at sun.reflect.NativeMethodAccessorImpl.invoke0(Native Method)
	at sun.reflect.NativeMethodAccessorImpl.invoke(NativeMethodAccessorImpl.java:57)
	at sun.reflect.DelegatingMethodAccessorImpl.invoke(DelegatingMethodAccessorImpl.java:43)
	at java.lang.reflect.Method.invoke(Method.java:606)
(47 more lines...)
java.util.concurrent.TimeoutException: Timeout occurred. Expected true but found false.
	at co.cask.cdap.common.utils.Tasks.waitFor(Tasks.java:70)
	at co.cask.cdap.common.utils.Tasks.waitFor(Tasks.java:91)
	at co.cask.cdap.app.etl.ETLTestBase.setup(ETLTestBase.java:82)
	at sun.reflect.NativeMethodAccessorImpl.invoke0(Native Method)
	at sun.reflect.NativeMethodAccessorImpl.invoke(NativeMethodAccessorImpl.java:57)
	at sun.reflect.DelegatingMethodAccessorImpl.invoke(DelegatingMethodAccessorImpl.java:43)
	at java.lang.reflect.Method.invoke(Method.java:606)
(47 more lines...)
java.util.concurrent.TimeoutException: Timeout occurred. Expected true but found false.
	at co.cask.cdap.common.utils.Tasks.waitFor(Tasks.java:70)
	at co.cask.cdap.common.utils.Tasks.waitFor(Tasks.java:91)
	at co.cask.cdap.app.etl.ETLTestBase.setup(ETLTestBase.java:82)
	at sun.reflect.NativeMethodAccessorImpl.invoke0(Native Method)
	at sun.reflect.NativeMethodAccessorImpl.invoke(NativeMethodAccessorImpl.java:57)
	at sun.reflect.DelegatingMethodAccessorImpl.invoke(DelegatingMethodAccessorImpl.java:43)
	at java.lang.reflect.Method.invoke(Method.java:606)
(47 more lines...)
java.util.concurrent.TimeoutException: Timeout occurred. Expected true but found false.
	at co.cask.cdap.common.utils.Tasks.waitFor(Tasks.java:70)
	at co.cask.cdap.common.utils.Tasks.waitFor(Tasks.java:91)
	at co.cask.cdap.app.etl.ETLTestBase.setup(ETLTestBase.java:82)
	at sun.reflect.NativeMethodAccessorImpl.invoke0(Native Method)
	at sun.reflect.NativeMethodAccessorImpl.invoke(NativeMethodAccessorImpl.java:57)
	at sun.reflect.DelegatingMethodAccessorImpl.invoke(DelegatingMethodAccessorImpl.java:43)
	at java.lang.reflect.Method.invoke(Method.java:606)
(47 more lines...)
java.util.concurrent.TimeoutException: Timeout occurred. Expected true but found false.
	at co.cask.cdap.common.utils.Tasks.waitFor(Tasks.java:70)
	at co.cask.cdap.common.utils.Tasks.waitFor(Tasks.java:91)
	at co.cask.cdap.app.etl.ETLTestBase.setup(ETLTestBase.java:82)
	at sun.reflect.NativeMethodAccessorImpl.invoke0(Native Method)
	at sun.reflect.NativeMethodAccessorImpl.invoke(NativeMethodAccessorImpl.java:57)
	at sun.reflect.DelegatingMethodAccessorImpl.invoke(DelegatingMethodAccessorImpl.java:43)
	at java.lang.reflect.Method.invoke(Method.java:606)
(47 more lines...)
java.util.concurrent.TimeoutException: Timeout occurred. Expected true but found false.
	at co.cask.cdap.common.utils.Tasks.waitFor(Tasks.java:70)
	at co.cask.cdap.common.utils.Tasks.waitFor(Tasks.java:91)
	at co.cask.cdap.app.etl.ETLTestBase.setup(ETLTestBase.java:82)
	at sun.reflect.NativeMethodAccessorImpl.invoke0(Native Method)
	at sun.reflect.NativeMethodAccessorImpl.invoke(NativeMethodAccessorImpl.java:57)
	at sun.reflect.DelegatingMethodAccessorImpl.invoke(DelegatingMethodAccessorImpl.java:43)
	at java.lang.reflect.Method.invoke(Method.java:606)
(47 more lines...)
java.util.concurrent.TimeoutException: Timeout occurred. Expected true but found false.
	at co.cask.cdap.common.utils.Tasks.waitFor(Tasks.java:70)
	at co.cask.cdap.common.utils.Tasks.waitFor(Tasks.java:91)
	at co.cask.cdap.app.etl.ETLTestBase.setup(ETLTestBase.java:82)
	at sun.reflect.NativeMethodAccessorImpl.invoke0(Native Method)
	at sun.reflect.NativeMethodAccessorImpl.invoke(NativeMethodAccessorImpl.java:57)
	at sun.reflect.DelegatingMethodAccessorImpl.invoke(DelegatingMethodAccessorImpl.java:43)
	at java.lang.reflect.Method.invoke(Method.java:606)
(47 more lines...)
java.util.concurrent.TimeoutException: Timeout occurred. Expected true but found false.
	at co.cask.cdap.common.utils.Tasks.waitFor(Tasks.java:70)
	at co.cask.cdap.common.utils.Tasks.waitFor(Tasks.java:91)
	at co.cask.cdap.app.etl.ETLTestBase.setup(ETLTestBase.java:82)
	at sun.reflect.NativeMethodAccessorImpl.invoke0(Native Method)
	at sun.reflect.NativeMethodAccessorImpl.invoke(NativeMethodAccessorImpl.java:57)
	at sun.reflect.DelegatingMethodAccessorImpl.invoke(DelegatingMethodAccessorImpl.java:43)
	at java.lang.reflect.Method.invoke(Method.java:606)
(47 more lines...)
java.util.concurrent.TimeoutException: Timeout occurred. Expected true but found false.
	at co.cask.cdap.common.utils.Tasks.waitFor(Tasks.java:70)
	at co.cask.cdap.common.utils.Tasks.waitFor(Tasks.java:91)
	at co.cask.cdap.app.etl.ETLTestBase.setup(ETLTestBase.java:82)
	at sun.reflect.NativeMethodAccessorImpl.invoke0(Native Method)
	at sun.reflect.NativeMethodAccessorImpl.invoke(NativeMethodAccessorImpl.java:57)
	at sun.reflect.DelegatingMethodAccessorImpl.invoke(DelegatingMethodAccessorImpl.java:43)
	at java.lang.reflect.Method.invoke(Method.java:606)
(47 more lines...)
java.util.concurrent.TimeoutException: Timeout occurred. Expected true but found false.
	at co.cask.cdap.common.utils.Tasks.waitFor(Tasks.java:70)
	at co.cask.cdap.common.utils.Tasks.waitFor(Tasks.java:91)
	at co.cask.cdap.app.etl.ETLTestBase.setup(ETLTestBase.java:82)
	at sun.reflect.NativeMethodAccessorImpl.invoke0(Native Method)
	at sun.reflect.NativeMethodAccessorImpl.invoke(NativeMethodAccessorImpl.java:57)
	at sun.reflect.DelegatingMethodAccessorImpl.invoke(DelegatingMethodAccessorImpl.java:43)
	at java.lang.reflect.Method.invoke(Method.java:606)
(48 more lines...)
java.util.concurrent.TimeoutException: Timeout occurred. Expected true but found false.
	at co.cask.cdap.common.utils.Tasks.waitFor(Tasks.java:70)
	at co.cask.cdap.common.utils.Tasks.waitFor(Tasks.java:91)
	at co.cask.cdap.app.etl.ETLTestBase.setup(ETLTestBase.java:82)
	at sun.reflect.NativeMethodAccessorImpl.invoke0(Native Method)
	at sun.reflect.NativeMethodAccessorImpl.invoke(NativeMethodAccessorImpl.java:57)
	at sun.reflect.DelegatingMethodAccessorImpl.invoke(DelegatingMethodAccessorImpl.java:43)
	at java.lang.reflect.Method.invoke(Method.java:606)
(48 more lines...)
java.util.concurrent.TimeoutException: Timeout occurred. Expected true but found false.
	at co.cask.cdap.common.utils.Tasks.waitFor(Tasks.java:70)
	at co.cask.cdap.common.utils.Tasks.waitFor(Tasks.java:91)
	at co.cask.cdap.app.etl.ETLTestBase.setup(ETLTestBase.java:82)
	at sun.reflect.NativeMethodAccessorImpl.invoke0(Native Method)
	at sun.reflect.NativeMethodAccessorImpl.invoke(NativeMethodAccessorImpl.java:57)
	at sun.reflect.DelegatingMethodAccessorImpl.invoke(DelegatingMethodAccessorImpl.java:43)
	at java.lang.reflect.Method.invoke(Method.java:606)
(47 more lines...)
java.util.concurrent.TimeoutException: Timeout occurred. Expected true but found false.
	at co.cask.cdap.common.utils.Tasks.waitFor(Tasks.java:70)
	at co.cask.cdap.common.utils.Tasks.waitFor(Tasks.java:91)
	at co.cask.cdap.app.etl.ETLTestBase.setup(ETLTestBase.java:82)
	at sun.reflect.GeneratedMethodAccessor5.invoke(Unknown Source)
	at sun.reflect.DelegatingMethodAccessorImpl.invoke(DelegatingMethodAccessorImpl.java:43)
	at java.lang.reflect.Method.invoke(Method.java:606)
	at org.junit.runners.model.FrameworkMethod$1.runReflectiveCall(FrameworkMethod.java:47)
(46 more lines...)
java.util.concurrent.TimeoutException: Timeout occurred. Expected true but found false.
	at co.cask.cdap.common.utils.Tasks.waitFor(Tasks.java:70)
	at co.cask.cdap.common.utils.Tasks.waitFor(Tasks.java:91)
	at co.cask.cdap.app.etl.ETLTestBase.setup(ETLTestBase.java:82)
	at sun.reflect.GeneratedMethodAccessor5.invoke(Unknown Source)
	at sun.reflect.DelegatingMethodAccessorImpl.invoke(DelegatingMethodAccessorImpl.java:43)
	at java.lang.reflect.Method.invoke(Method.java:606)
	at org.junit.runners.model.FrameworkMethod$1.runReflectiveCall(FrameworkMethod.java:47)
(46 more lines...)
java.util.concurrent.TimeoutException: Timeout occurred. Expected true but found false.
	at co.cask.cdap.common.utils.Tasks.waitFor(Tasks.java:70)
	at co.cask.cdap.common.utils.Tasks.waitFor(Tasks.java:91)
	at co.cask.cdap.app.etl.ETLTestBase.setup(ETLTestBase.java:82)
	at sun.reflect.GeneratedMethodAccessor5.invoke(Unknown Source)
	at sun.reflect.DelegatingMethodAccessorImpl.invoke(DelegatingMethodAccessorImpl.java:43)
	at java.lang.reflect.Method.invoke(Method.java:606)
	at org.junit.runners.model.FrameworkMethod$1.runReflectiveCall(FrameworkMethod.java:47)
(46 more lines...)
java.util.concurrent.TimeoutException: Timeout occurred. Expected true but found false.
	at co.cask.cdap.common.utils.Tasks.waitFor(Tasks.java:70)
	at co.cask.cdap.common.utils.Tasks.waitFor(Tasks.java:91)
	at co.cask.cdap.app.etl.ETLTestBase.setup(ETLTestBase.java:82)
	at sun.reflect.GeneratedMethodAccessor5.invoke(Unknown Source)
	at sun.reflect.DelegatingMethodAccessorImpl.invoke(DelegatingMethodAccessorImpl.java:43)
	at java.lang.reflect.Method.invoke(Method.java:606)
	at org.junit.runners.model.FrameworkMethod$1.runReflectiveCall(FrameworkMethod.java:47)
(46 more lines...)
java.util.concurrent.TimeoutException: Timeout occurred. Expected true but found false.
	at co.cask.cdap.common.utils.Tasks.waitFor(Tasks.java:70)
	at co.cask.cdap.common.utils.Tasks.waitFor(Tasks.java:91)
	at co.cask.cdap.app.etl.ETLTestBase.setup(ETLTestBase.java:82)
	at sun.reflect.GeneratedMethodAccessor5.invoke(Unknown Source)
	at sun.reflect.DelegatingMethodAccessorImpl.invoke(DelegatingMethodAccessorImpl.java:43)
	at java.lang.reflect.Method.invoke(Method.java:606)
	at org.junit.runners.model.FrameworkMethod$1.runReflectiveCall(FrameworkMethod.java:47)
(46 more lines...)
java.util.concurrent.TimeoutException: Timeout occurred. Expected true but found false.
	at co.cask.cdap.common.utils.Tasks.waitFor(Tasks.java:70)
	at co.cask.cdap.common.utils.Tasks.waitFor(Tasks.java:91)
	at co.cask.cdap.app.etl.ETLTestBase.setup(ETLTestBase.java:82)
	at sun.reflect.GeneratedMethodAccessor5.invoke(Unknown Source)
	at sun.reflect.DelegatingMethodAccessorImpl.invoke(DelegatingMethodAccessorImpl.java:43)
	at java.lang.reflect.Method.invoke(Method.java:606)
	at org.junit.runners.model.FrameworkMethod$1.runReflectiveCall(FrameworkMethod.java:47)
(46 more lines...)
java.util.concurrent.TimeoutException: Timeout occurred. Expected true but found false.
	at co.cask.cdap.common.utils.Tasks.waitFor(Tasks.java:70)
	at co.cask.cdap.common.utils.Tasks.waitFor(Tasks.java:91)
	at co.cask.cdap.app.etl.ETLTestBase.setup(ETLTestBase.java:82)
	at sun.reflect.GeneratedMethodAccessor5.invoke(Unknown Source)
	at sun.reflect.DelegatingMethodAccessorImpl.invoke(DelegatingMethodAccessorImpl.java:43)
	at java.lang.reflect.Method.invoke(Method.java:606)
	at org.junit.runners.model.FrameworkMethod$1.runReflectiveCall(FrameworkMethod.java:47)
(46 more lines...)
java.util.concurrent.TimeoutException: Timeout occurred. Expected true but found false.
	at co.cask.cdap.common.utils.Tasks.waitFor(Tasks.java:70)
	at co.cask.cdap.common.utils.Tasks.waitFor(Tasks.java:91)
	at co.cask.cdap.app.etl.ETLTestBase.setup(ETLTestBase.java:82)
	at sun.reflect.GeneratedMethodAccessor5.invoke(Unknown Source)
	at sun.reflect.DelegatingMethodAccessorImpl.invoke(DelegatingMethodAccessorImpl.java:43)
	at java.lang.reflect.Method.invoke(Method.java:606)
	at org.junit.runners.model.FrameworkMethod$1.runReflectiveCall(FrameworkMethod.java:47)
(46 more lines...)
java.util.concurrent.TimeoutException: Timeout occurred. Expected true but found false.
	at co.cask.cdap.common.utils.Tasks.waitFor(Tasks.java:70)
	at co.cask.cdap.common.utils.Tasks.waitFor(Tasks.java:91)
	at co.cask.cdap.app.etl.ETLTestBase.setup(ETLTestBase.java:82)
	at sun.reflect.NativeMethodAccessorImpl.invoke0(Native Method)
	at sun.reflect.NativeMethodAccessorImpl.invoke(NativeMethodAccessorImpl.java:57)
	at sun.reflect.DelegatingMethodAccessorImpl.invoke(DelegatingMethodAccessorImpl.java:43)
	at java.lang.reflect.Method.invoke(Method.java:606)
(47 more lines...)
java.util.concurrent.TimeoutException: Timeout occurred. Expected true but found false.
	at co.cask.cdap.common.utils.Tasks.waitFor(Tasks.java:70)
	at co.cask.cdap.common.utils.Tasks.waitFor(Tasks.java:91)
	at co.cask.cdap.app.etl.ETLTestBase.setup(ETLTestBase.java:82)
	at sun.reflect.GeneratedMethodAccessor5.invoke(Unknown Source)
	at sun.reflect.DelegatingMethodAccessorImpl.invoke(DelegatingMethodAccessorImpl.java:43)
	at java.lang.reflect.Method.invoke(Method.java:606)
	at org.junit.runners.model.FrameworkMethod$1.runReflectiveCall(FrameworkMethod.java:47)
(46 more lines...)
java.util.concurrent.TimeoutException: Timeout occurred. Expected true but found false.
	at co.cask.cdap.common.utils.Tasks.waitFor(Tasks.java:70)
	at co.cask.cdap.common.utils.Tasks.waitFor(Tasks.java:91)
	at co.cask.cdap.app.etl.ETLTestBase.setup(ETLTestBase.java:82)
	at sun.reflect.GeneratedMethodAccessor5.invoke(Unknown Source)
	at sun.reflect.DelegatingMethodAccessorImpl.invoke(DelegatingMethodAccessorImpl.java:43)
	at java.lang.reflect.Method.invoke(Method.java:606)
	at org.junit.runners.model.FrameworkMethod$1.runReflectiveCall(FrameworkMethod.java:47)
(46 more lines...)
java.util.concurrent.TimeoutException: Timeout occurred. Expected true but found false.
	at co.cask.cdap.common.utils.Tasks.waitFor(Tasks.java:70)
	at co.cask.cdap.common.utils.Tasks.waitFor(Tasks.java:91)
	at co.cask.cdap.app.etl.ETLTestBase.setup(ETLTestBase.java:82)
	at sun.reflect.GeneratedMethodAccessor5.invoke(Unknown Source)
	at sun.reflect.DelegatingMethodAccessorImpl.invoke(DelegatingMethodAccessorImpl.java:43)
	at java.lang.reflect.Method.invoke(Method.java:606)
	at org.junit.runners.model.FrameworkMethod$1.runReflectiveCall(FrameworkMethod.java:47)
(46 more lines...)
java.util.concurrent.TimeoutException: Timeout occurred. Expected true but found false.
	at co.cask.cdap.common.utils.Tasks.waitFor(Tasks.java:70)
	at co.cask.cdap.common.utils.Tasks.waitFor(Tasks.java:91)
	at co.cask.cdap.common.utils.Tasks.waitFor(Tasks.java:130)
	at co.cask.cdap.test.AbstractProgramManager.waitForRuns(AbstractProgramManager.java:90)
	at co.cask.cdap.test.AbstractProgramManager.waitForRun(AbstractProgramManager.java:84)
	at co.cask.cdap.apps.transaction.TransactionTimeoutTest.testFlowletTimeouts(TransactionTimeoutTest.java:69)
Fixed tests 2
Status Test Failing since View job Duration
Successful AppImpersonationTest test History
Failing since build #249 (Scheduled) Distro Tests - CDH 5.5 3 mins
Successful CrossNSAppImpersonationTest testAcrossNamespaces History
Failing since build #249 (Scheduled) Distro Tests - CDH 5.5 < 1 sec