Build #3,066

Cask Data Application Platform - Develop Build and Test

Build: #3066 failed

Job: Unit Test Job failed

Stages & jobs

  1. Unit Test Stage

Job result summary

Completed
Duration
146 minutes
Agent
bamboo-agent06
Revision
73fe3dcf9c85549cbc6cf50a203286e5ceb8ca52 73fe3dcf9c85549cbc6cf50a203286e5ceb8ca52
Total tests
2859
Fixed in
#3067 (Child of CDAP-DRC-5091)

Tests

  • 2,859 tests in total
  • 3 tests failed
  • 3 failures are new
  • 17 tests were quarantined / skipped
  • 128 minutes taken in total.
New test failures 3
Status Test Duration
Collapse Failed PreviewDataPipelineTest testDataPipelinePreviewRuns History
< 1 sec
io.cdap.cdap.api.dataset.InstanceConflictException: Failed to add instance singleInput due to conflict, details: Response code: 409, message: 'Conflict', body: ''dataset:default.singleInput' already exists'
	at io.cdap.cdap.data2.datafabric.dataset.DatasetServiceClient.addInstance(DatasetServiceClient.java:169)
	at io.cdap.cdap.data2.datafabric.dataset.RemoteDatasetFramework.addInstance(RemoteDatasetFramework.java:147)
	at io.cdap.cdap.data2.dataset2.ForwardingDatasetFramework.addInstance(ForwardingDatasetFramework.java:79)
	at io.cdap.cdap.data2.dataset2.DatasetFramework.addInstance(DatasetFramework.java:140)
	at io.cdap.cdap.test.UnitTestManager.addDatasetInstance(UnitTestManager.java:302)
	at io.cdap.cdap.test.TestBase.addDatasetInstance(TestBase.java:801)
	at io.cdap.cdap.test.TestBase.addDatasetInstance(TestBase.java:816)
(44 more lines...)
Collapse Failed PreviewDataPipelineTest testPreviewFailedRun History
< 1 sec
io.cdap.cdap.api.dataset.InstanceConflictException: Failed to add instance singleInput due to conflict, details: Response code: 409, message: 'Conflict', body: ''dataset:default.singleInput' already exists'
	at io.cdap.cdap.data2.datafabric.dataset.DatasetServiceClient.addInstance(DatasetServiceClient.java:169)
	at io.cdap.cdap.data2.datafabric.dataset.RemoteDatasetFramework.addInstance(RemoteDatasetFramework.java:147)
	at io.cdap.cdap.data2.dataset2.ForwardingDatasetFramework.addInstance(ForwardingDatasetFramework.java:79)
	at io.cdap.cdap.data2.dataset2.DatasetFramework.addInstance(DatasetFramework.java:140)
	at io.cdap.cdap.test.UnitTestManager.addDatasetInstance(UnitTestManager.java:302)
	at io.cdap.cdap.test.TestBase.addDatasetInstance(TestBase.java:801)
	at io.cdap.cdap.test.TestBase.addDatasetInstance(TestBase.java:816)
(44 more lines...)
Collapse Failed PreviewDataPipelineTest testPreviewStop History
5 mins
java.util.concurrent.TimeoutException: Timeout occurred. Expected KILLED but found COMPLETED.
	at io.cdap.cdap.common.utils.Tasks.waitFor(Tasks.java:70)
	at io.cdap.cdap.common.utils.Tasks.waitFor(Tasks.java:91)
	at io.cdap.cdap.common.utils.Tasks.waitFor(Tasks.java:130)
	at io.cdap.cdap.datapipeline.preview.PreviewDataPipelineTest.testDataPipelinePreviewStop(PreviewDataPipelineTest.java:237)
	at io.cdap.cdap.datapipeline.preview.PreviewDataPipelineTest.testPreviewStop(PreviewDataPipelineTest.java:179)
	at sun.reflect.NativeMethodAccessorImpl.invoke0(Native Method)
	at sun.reflect.NativeMethodAccessorImpl.invoke(NativeMethodAccessorImpl.java:62)
(40 more lines...)