Build #2,680

Cask Data Application Platform - Develop Build and Test

Build: #2680 failed

Job: Unit Test Job failed

Stages & jobs

  1. Unit Test Stage

Job result summary

Completed
Duration
33 minutes
Agent
bamboo-agent18
Revision
e31f8e4cbc884705e11f46429e57aacfcf83a852 e31f8e4cbc884705e11f46429e57aacfcf83a852
Total tests
1866
Fixed in
#2681 (Child of CDAP-DRC-4589)

Tests

  • 1,866 tests in total
  • 8 tests failed
  • 8 failures are new
  • 13 tests were quarantined / skipped
  • 36 minutes taken in total.
New test failures 8
Status Test Duration
Collapse Failed ProgramLifecycleHttpHandlerTest io.cdap.cdap.internal.app.services.http.handlers.ProgramLifecycleHttpHandlerTest History
14 secs
java.util.concurrent.TimeoutException: Timeout occurred. Expected 200 but found 409.
	at io.cdap.cdap.common.utils.Tasks.waitFor(Tasks.java:70)
	at io.cdap.cdap.common.utils.Tasks.waitFor(Tasks.java:91)
	at io.cdap.cdap.common.utils.Tasks.waitFor(Tasks.java:130)
	at io.cdap.cdap.internal.app.services.http.AppFabricTestBase.deleteNamespaces(AppFabricTestBase.java:972)
	at io.cdap.cdap.internal.app.services.http.AppFabricTestBase.afterClass(AppFabricTestBase.java:300)
	at sun.reflect.NativeMethodAccessorImpl.invoke0(Native Method)
	at sun.reflect.NativeMethodAccessorImpl.invoke(NativeMethodAccessorImpl.java:62)
(26 more lines...)
Collapse Failed ProgramLifecycleHttpHandlerTest testProgramList History
< 1 sec
org.junit.ComparisonFailure: expected:<[[]]> but was:<[[{"type":"Workflow","app":"App","name":"NoOpWorkflow","description":"NoOp Workflow description"},{"type":"Workflow","app":"SleepWorkflowApp","name":"SleepWorkflow","description":"FunWorkflow description"}]]>
org.junit.ComparisonFailure: expected:<[[]]> but was:<[[{"type":"Workflow","app":"App","name":"NoOpWorkflow","description":"NoOp Workflow description"},{"type":"Workflow","app":"SleepWorkflowApp","name":"SleepWorkflow","description":"FunWorkflow description"}]]>	at org.junit.Assert.assertEquals(Assert.java:115)	at org.junit.Assert.assertEquals(Assert.java:144)	at io.cdap.cdap.internal.app.services.http.handlers.ProgramLifecycleHttpHandlerTest.testListInitialState(ProgramLifecycleHttpHandlerTest.java:1657)	at io.cdap.cdap.internal.app.services.http.handlers.ProgramLifecycleHttpHandlerTest.testProgramList(ProgramLifecycleHttpHandlerTest.java:868)	at sun.reflect.NativeMethodAccessorImpl.invoke0(Native Method)	at sun.reflect.NativeMethodAccessorImpl.invoke(NativeMethodAccessorImpl.java:62)	at sun.reflect.DelegatingMethodAccessorImpl.invoke(DelegatingMethodAccessorImpl.java:43)	at java.lang.reflect.Method.invoke(Method.java:498)	at org.junit.runners.model.FrameworkMethod$1.runReflectiveCall(FrameworkMethod.java:47)	at org.junit.internal.runners.model.ReflectiveCallable.run(ReflectiveCallable.java:12)	at org.junit.runners.model.FrameworkMethod.invokeExplosively(FrameworkMethod.java:44)	at org.junit.internal.runners.statements.InvokeMethod.evaluate(InvokeMethod.java:17)	at org.junit.internal.runners.statements.RunAfters.evaluate(RunAfters.java:27)	at org.junit.runners.ParentRunner.runLeaf(ParentRunner.java:271)	at org.junit.runners.BlockJUnit4ClassRunner.runChild(BlockJUnit4ClassRunner.java:70)	at org.junit.runners.BlockJUnit4ClassRunner.runChild(BlockJUnit4ClassRunner.java:50)	at org.junit.runners.ParentRunner$3.run(ParentRunner.java:238)	at org.junit.runners.ParentRunner$1.schedule(ParentRunner.java:63)	at org.junit.runners.ParentRunner.runChildren(ParentRunner.java:236)	at org.junit.runners.ParentRunner.access$000(ParentRunner.java:53)	at org.junit.runners.ParentRunner$2.evaluate(ParentRunner.java:229)	at org.junit.internal.runners.statements.RunBefores.evaluate(RunBefores.java:26)	at org.junit.internal.runners.statements.RunAfters.evaluate(RunAfters.java:27)	at org.junit.rules.ExternalResource$1.evaluate(ExternalResource.java:48)	at org.junit.rules.RunRules.evaluate(RunRules.java:20)	at org.junit.runners.ParentRunner.run(ParentRunner.java:309)	at org.junit.runners.Suite.runChild(Suite.java:127)	at org.junit.runners.Suite.runChild(Suite.java:26)	at org.junit.runners.ParentRunner$3.run(ParentRunner.java:238)	at org.junit.runners.ParentRunner$1.schedule(ParentRunner.java:63)	at org.junit.runners.ParentRunner.runChildren(ParentRunner.java:236)	at org.junit.runners.ParentRunner.access$000(ParentRunner.java:53)	at org.junit.runners.ParentRunner$2.evaluate(ParentRunner.java:229)	at org.junit.runners.ParentRunner.run(ParentRunner.java:309)	at org.apache.maven.surefire.junitcore.JUnitCore.run(JUnitCore.java:55)	at org.apache.maven.surefire.junitcore.JUnitCoreWrapper.createRequestAndRun(JUnitCoreWrapper.java:137)	at org.apache.maven.surefire.junitcore.JUnitCoreWrapper.executeEager(JUnitCoreWrapper.java:107)	at org.apache.maven.surefire.junitcore.JUnitCoreWrapper.execute(JUnitCoreWrapper.java:83)	at org.apache.maven.surefire.junitcore.JUnitCoreWrapper.execute(JUnitCoreWrapper.java:75)	at org.apache.maven.surefire.junitcore.JUnitCoreProvider.invoke(JUnitCoreProvider.java:161)	at org.apache.maven.surefire.booter.ForkedBooter.invokeProviderInSameClassLoader(ForkedBooter.java:290)	at org.apache.maven.surefire.booter.ForkedBooter.runSuitesInProcess(ForkedBooter.java:242)	at org.apache.maven.surefire.booter.ForkedBooter.main(ForkedBooter.java:121)
Collapse Failed ProgramLifecycleHttpHandlerTest testProgramStartStopStatus History
17 secs
java.lang.AssertionError: expected:<200> but was:<409>
	at org.junit.Assert.fail(Assert.java:88)
	at org.junit.Assert.failNotEquals(Assert.java:743)
	at org.junit.Assert.assertEquals(Assert.java:118)
	at org.junit.Assert.assertEquals(Assert.java:555)
	at org.junit.Assert.assertEquals(Assert.java:542)
	at io.cdap.cdap.internal.app.services.http.handlers.ProgramLifecycleHttpHandlerTest.testProgramStartStopStatus(ProgramLifecycleHttpHandlerTest.java:256)
	at sun.reflect.NativeMethodAccessorImpl.invoke0(Native Method)
(38 more lines...)
Collapse Failed ProgramLifecycleHttpHandlerTest testProgramStartStopStatusErrors History
57 secs
java.lang.AssertionError: expected:<200> but was:<409>
	at org.junit.Assert.fail(Assert.java:88)
	at org.junit.Assert.failNotEquals(Assert.java:743)
	at org.junit.Assert.assertEquals(Assert.java:118)
	at org.junit.Assert.assertEquals(Assert.java:555)
	at org.junit.Assert.assertEquals(Assert.java:542)
	at io.cdap.cdap.internal.app.services.http.handlers.ProgramLifecycleHttpHandlerTest.testProgramStartStopStatusErrors(ProgramLifecycleHttpHandlerTest.java:444)
	at sun.reflect.NativeMethodAccessorImpl.invoke0(Native Method)
(38 more lines...)
Collapse Failed ProgramLifecycleHttpHandlerTest testProvisionerFailureStateAndMetrics History
3 secs
java.lang.AssertionError: expected:<200> but was:<409>
	at org.junit.Assert.fail(Assert.java:88)
	at org.junit.Assert.failNotEquals(Assert.java:743)
	at org.junit.Assert.assertEquals(Assert.java:118)
	at org.junit.Assert.assertEquals(Assert.java:555)
	at org.junit.Assert.assertEquals(Assert.java:542)
	at io.cdap.cdap.internal.app.services.http.handlers.ProgramLifecycleHttpHandlerTest.testProvisionerFailureStateAndMetrics(ProgramLifecycleHttpHandlerTest.java:550)
	at sun.reflect.NativeMethodAccessorImpl.invoke0(Native Method)
(38 more lines...)
Collapse Failed ProgramLifecycleHttpHandlerTest testStopProgramRunWhilePending History
1 min
java.lang.AssertionError: expected:<200> but was:<409>
	at org.junit.Assert.fail(Assert.java:88)
	at org.junit.Assert.failNotEquals(Assert.java:743)
	at org.junit.Assert.assertEquals(Assert.java:118)
	at org.junit.Assert.assertEquals(Assert.java:555)
	at org.junit.Assert.assertEquals(Assert.java:542)
	at io.cdap.cdap.internal.app.services.http.handlers.ProgramLifecycleHttpHandlerTest.testStopProgramRunWhilePending(ProgramLifecycleHttpHandlerTest.java:609)
	at sun.reflect.NativeMethodAccessorImpl.invoke0(Native Method)
(38 more lines...)
Collapse Failed ProgramLifecycleHttpHandlerTest testStopProgramWhilePending History
1 min
java.lang.AssertionError: expected:<200> but was:<409>
	at org.junit.Assert.fail(Assert.java:88)
	at org.junit.Assert.failNotEquals(Assert.java:743)
	at org.junit.Assert.assertEquals(Assert.java:118)
	at org.junit.Assert.assertEquals(Assert.java:555)
	at org.junit.Assert.assertEquals(Assert.java:542)
	at io.cdap.cdap.internal.app.services.http.handlers.ProgramLifecycleHttpHandlerTest.testStopProgramWhilePending(ProgramLifecycleHttpHandlerTest.java:578)
	at sun.reflect.NativeMethodAccessorImpl.invoke0(Native Method)
(38 more lines...)
Collapse Failed ProgramLifecycleHttpHandlerTest testWorkflowHistory History
1 min
java.lang.AssertionError: expected:<200> but was:<409>
	at org.junit.Assert.fail(Assert.java:88)
	at org.junit.Assert.failNotEquals(Assert.java:743)
	at org.junit.Assert.assertEquals(Assert.java:118)
	at org.junit.Assert.assertEquals(Assert.java:555)
	at org.junit.Assert.assertEquals(Assert.java:542)
	at io.cdap.cdap.internal.app.services.http.handlers.ProgramLifecycleHttpHandlerTest.testWorkflowHistory(ProgramLifecycleHttpHandlerTest.java:513)
	at sun.reflect.NativeMethodAccessorImpl.invoke0(Native Method)
(38 more lines...)