Cask Data Application Platform - Develop Build and Test

Build: #2673 failed

Job: Unit Test Job failed

Stages & jobs

  1. Unit Test Stage

Io.cdap.cdap.config. sql user config store test: Test case result

The below summarizes the result of the test "Io.cdap.cdap.config. sql user config store test" in build 2,673 of CDAP - Develop Build and Test - Unit Test Job. View test case history
Description
Io.cdap.cdap.config. sql user config store test
Test class
io.cdap.cdap.config.SqlUserConfigStoreTest
Method
io.cdap.cdap.config.SqlUserConfigStoreTest
Duration
< 1 sec
Status
Failed (New Failure)

Error Log

java.io.IOException: Gave up waiting for server to start after 10000ms
	at com.opentable.db.postgres.embedded.EmbeddedPostgres.waitForServerStartup(EmbeddedPostgres.java:330)
	at com.opentable.db.postgres.embedded.EmbeddedPostgres.startPostmaster(EmbeddedPostgres.java:275)
	at com.opentable.db.postgres.embedded.EmbeddedPostgres.<init>(EmbeddedPostgres.java:162)
	at com.opentable.db.postgres.embedded.EmbeddedPostgres$Builder.start(EmbeddedPostgres.java:580)
	at io.cdap.cdap.spi.data.sql.PostgresInstantiator.createAndStart(PostgresInstantiator.java:60)
	at io.cdap.cdap.config.SqlUserConfigStoreTest.setup(SqlUserConfigStoreTest.java:51)
	at sun.reflect.NativeMethodAccessorImpl.invoke0(Native Method)
	at sun.reflect.NativeMethodAccessorImpl.invoke(NativeMethodAccessorImpl.java:62)
	at sun.reflect.DelegatingMethodAccessorImpl.invoke(DelegatingMethodAccessorImpl.java:43)
	at java.lang.reflect.Method.invoke(Method.java:498)
	at org.junit.runners.model.FrameworkMethod$1.runReflectiveCall(FrameworkMethod.java:47)
	at org.junit.internal.runners.model.ReflectiveCallable.run(ReflectiveCallable.java:12)
	at org.junit.runners.model.FrameworkMethod.invokeExplosively(FrameworkMethod.java:44)
	at org.junit.internal.runners.statements.RunBefores.evaluate(RunBefores.java:24)
	at org.junit.internal.runners.statements.RunAfters.evaluate(RunAfters.java:27)
	at org.junit.rules.ExternalResource$1.evaluate(ExternalResource.java:48)
	at org.junit.rules.RunRules.evaluate(RunRules.java:20)
	at org.junit.runners.ParentRunner.run(ParentRunner.java:309)
	at org.junit.runners.Suite.runChild(Suite.java:127)
	at org.junit.runners.Suite.runChild(Suite.java:26)
	at org.junit.runners.ParentRunner$3.run(ParentRunner.java:238)
	at org.junit.runners.ParentRunner$1.schedule(ParentRunner.java:63)
	at org.junit.runners.ParentRunner.runChildren(ParentRunner.java:236)
	at org.junit.runners.ParentRunner.access$000(ParentRunner.java:53)
	at org.junit.runners.ParentRunner$2.evaluate(ParentRunner.java:229)
	at org.junit.runners.ParentRunner.run(ParentRunner.java:309)
	at org.apache.maven.surefire.junitcore.JUnitCore.run(JUnitCore.java:55)
	at org.apache.maven.surefire.junitcore.JUnitCoreWrapper.createRequestAndRun(JUnitCoreWrapper.java:137)
	at org.apache.maven.surefire.junitcore.JUnitCoreWrapper.executeEager(JUnitCoreWrapper.java:107)
	at org.apache.maven.surefire.junitcore.JUnitCoreWrapper.execute(JUnitCoreWrapper.java:83)
	at org.apache.maven.surefire.junitcore.JUnitCoreWrapper.execute(JUnitCoreWrapper.java:75)
	at org.apache.maven.surefire.junitcore.JUnitCoreProvider.invoke(JUnitCoreProvider.java:161)
	at org.apache.maven.surefire.booter.ForkedBooter.invokeProviderInSameClassLoader(ForkedBooter.java:290)
	at org.apache.maven.surefire.booter.ForkedBooter.runSuitesInProcess(ForkedBooter.java:242)
	at org.apache.maven.surefire.booter.ForkedBooter.main(ForkedBooter.java:121)
Caused by: java.sql.SQLException: connect failed
	at com.opentable.db.postgres.embedded.EmbeddedPostgres.verifyReady(EmbeddedPostgres.java:341)
	at com.opentable.db.postgres.embedded.EmbeddedPostgres.waitForServerStartup(EmbeddedPostgres.java:315)
	... 34 more
Caused by: java.net.ConnectException: Connection refused
	at java.net.PlainSocketImpl.socketConnect(Native Method)
	at java.net.AbstractPlainSocketImpl.doConnect(AbstractPlainSocketImpl.java:350)
	at java.net.AbstractPlainSocketImpl.connectToAddress(AbstractPlainSocketImpl.java:206)
	at java.net.AbstractPlainSocketImpl.connect(AbstractPlainSocketImpl.java:188)
	at java.net.SocksSocketImpl.connect(SocksSocketImpl.java:392)
	at java.net.Socket.connect(Socket.java:589)
	at com.opentable.db.postgres.embedded.EmbeddedPostgres.verifyReady(EmbeddedPostgres.java:339)
	... 35 more