Build #2,477

Cask Data Application Platform - Develop Build and Test

Build: #2477 failed

Job: Unit Test Job failed

Stages & jobs

  1. Unit Test Stage

Job result summary

Completed
Duration
138 minutes
Agent
bamboo-agent17
Revision
cc318b57b15ce825665fe6f1ecab876c07f9f6c1 cc318b57b15ce825665fe6f1ecab876c07f9f6c1
Total tests
2386
Fixed in
#2478 (Manual run by Sreevatsan Raman)

Tests

  • 2,386 tests in total
  • 3 tests failed
  • 3 failures are new
  • 14 tests were quarantined / skipped
  • 76 minutes taken in total.
New test failures 3
Status Test Duration
Collapse Failed AppFabricServiceMainTest co.cask.cdap.master.environment.k8s.AppFabricServiceMainTest History
< 1 sec
com.google.common.util.concurrent.UncheckedExecutionException: java.lang.ClassCastException: co.cask.cdap.data2.dataset2.lib.table.leveldb.LevelDBTable cannot be cast to co.cask.cdap.data2.dataset2.lib.table.MetricsTable
	at com.google.common.cache.LocalCache$Segment.get(LocalCache.java:2258)
	at com.google.common.cache.LocalCache.get(LocalCache.java:3990)
	at com.google.common.cache.LocalCache.getOrLoad(LocalCache.java:3994)
	at com.google.common.cache.LocalCache$LocalLoadingCache.get(LocalCache.java:4878)
	at com.google.common.cache.LocalCache$LocalLoadingCache.getUnchecked(LocalCache.java:4884)
	at co.cask.cdap.data2.nosql.NoSqlStructuredTableRegistry.getSpecification(NoSqlStructuredTableRegistry.java:114)
	at co.cask.cdap.data2.nosql.NoSqlStructuredTableAdmin.getSpecification(NoSqlStructuredTableAdmin.java:81)
(49 more lines...)
Collapse Failed MessagingServiceMainTest co.cask.cdap.master.environment.k8s.MessagingServiceMainTest History
< 1 sec
com.google.common.util.concurrent.UncheckedExecutionException: java.lang.ClassCastException: co.cask.cdap.data2.dataset2.lib.table.leveldb.LevelDBTable cannot be cast to co.cask.cdap.data2.dataset2.lib.table.MetricsTable
	at com.google.common.cache.LocalCache$Segment.get(LocalCache.java:2258)
	at com.google.common.cache.LocalCache.get(LocalCache.java:3990)
	at com.google.common.cache.LocalCache.getOrLoad(LocalCache.java:3994)
	at com.google.common.cache.LocalCache$LocalLoadingCache.get(LocalCache.java:4878)
	at com.google.common.cache.LocalCache$LocalLoadingCache.getUnchecked(LocalCache.java:4884)
	at co.cask.cdap.data2.nosql.NoSqlStructuredTableRegistry.getSpecification(NoSqlStructuredTableRegistry.java:114)
	at co.cask.cdap.data2.nosql.NoSqlStructuredTableAdmin.getSpecification(NoSqlStructuredTableAdmin.java:81)
(49 more lines...)
Collapse Failed MetricsServiceMainTest co.cask.cdap.master.environment.k8s.MetricsServiceMainTest History
< 1 sec
com.google.common.util.concurrent.UncheckedExecutionException: java.lang.ClassCastException: co.cask.cdap.data2.dataset2.lib.table.leveldb.LevelDBTable cannot be cast to co.cask.cdap.data2.dataset2.lib.table.MetricsTable
	at com.google.common.cache.LocalCache$Segment.get(LocalCache.java:2258)
	at com.google.common.cache.LocalCache.get(LocalCache.java:3990)
	at com.google.common.cache.LocalCache.getOrLoad(LocalCache.java:3994)
	at com.google.common.cache.LocalCache$LocalLoadingCache.get(LocalCache.java:4878)
	at com.google.common.cache.LocalCache$LocalLoadingCache.getUnchecked(LocalCache.java:4884)
	at co.cask.cdap.data2.nosql.NoSqlStructuredTableRegistry.getSpecification(NoSqlStructuredTableRegistry.java:114)
	at co.cask.cdap.data2.nosql.NoSqlStructuredTableAdmin.getSpecification(NoSqlStructuredTableAdmin.java:81)
(49 more lines...)