Cask Data Application Platform - Develop Build and Test

Build: #11 failed

Job: Unit Test Job failed

Stages & jobs

  1. Unit Test Stage

Job result summary

Completed
Duration
52 minutes
Agent
Default Agent
Revision
5b6bd7ca78aa6b7e9f7667da8db536cab1b4f8ef 5b6bd7ca78aa6b7e9f7667da8db536cab1b4f8ef
Total tests
859
Failing since
#1 (Manual run by Terence Yim)
Fixed in
#12 (Manual run by Terence Yim)

No failed tests found, a possible compilation error occurred.

Tests

  • 859 tests in total
  • 30 minutes taken in total.

Error summary

The build generated some errors. See the full build log for more details.

        at com.google.common.util.concurrent.AbstractExecutionThreadService$1$1.run(AbstractExecutionThreadService.java:47)
        ... 1 more
Caused by: java.io.IOException: java.io.IOException: error=2, No such file or directory
        at java.lang.UNIXProcess.<init>(UNIXProcess.java:148)
        at java.lang.ProcessImpl.start(ProcessImpl.java:65)
        at java.lang.ProcessBuilder.start(ProcessBuilder.java:452)
        ... 3 more
Failed to start singlenode. java.io.IOException: Cannot run program "node": java.io.IOException: error=2, No such file or directory
Exception in thread "WebCloudAppService" java.lang.RuntimeException: java.io.IOException: Cannot run program "node": java.io.IOException: error=2, No such file or directory
        at com.google.common.base.Throwables.propagate(Throwables.java:160)
        at com.google.common.util.concurrent.AbstractExecutionThreadService$1$1.run(AbstractExecutionThreadService.java:69)
        at java.lang.Thread.run(Thread.java:662)
Caused by: java.io.IOException: Cannot run program "node": java.io.IOException: error=2, No such file or directory
        at java.lang.ProcessBuilder.start(ProcessBuilder.java:470)
        at co.cask.cdap.WebCloudAppService.startUp(WebCloudAppService.java:57)
        at com.google.common.util.concurrent.AbstractExecutionThreadService$1$1.run(AbstractExecutionThreadService.java:47)
        ... 1 more
Caused by: java.io.IOException: java.io.IOException: error=2, No such file or directory
        at java.lang.UNIXProcess.<init>(UNIXProcess.java:148)
        at java.lang.ProcessImpl.start(ProcessImpl.java:65)
        at java.lang.ProcessBuilder.start(ProcessBuilder.java:452)
        ... 3 more
Failed to start singlenode. java.io.IOException: Cannot run program "node": java.io.IOException: error=2, No such file or directory
Exception in thread "WebCloudAppService" java.lang.RuntimeException: java.io.IOException: Cannot run program "node": java.io.IOException: error=2, No such file or directory
        at com.google.common.base.Throwables.propagate(Throwables.java:160)
        at com.google.common.util.concurrent.AbstractExecutionThreadService$1$1.run(AbstractExecutionThreadService.java:69)
        at java.lang.Thread.run(Thread.java:662)
Caused by: java.io.IOException: Cannot run program "node": java.io.IOException: error=2, No such file or directory
        at java.lang.ProcessBuilder.start(ProcessBuilder.java:470)
        at co.cask.cdap.WebCloudAppService.startUp(WebCloudAppService.java:57)
        at com.google.common.util.concurrent.AbstractExecutionThreadService$1$1.run(AbstractExecutionThreadService.java:47)
        ... 1 more
Caused by: java.io.IOException: java.io.IOException: error=2, No such file or directory
        at java.lang.UNIXProcess.<init>(UNIXProcess.java:148)
        at java.lang.ProcessImpl.start(ProcessImpl.java:65)
        at java.lang.ProcessBuilder.start(ProcessBuilder.java:452)
        ... 3 more
Failed to start singlenode. java.io.IOException: Cannot run program "node": java.io.IOException: error=2, No such file or directory
Exception in thread "WebCloudAppService" java.lang.RuntimeException: java.io.IOException: Cannot run program "node": java.io.IOException: error=2, No such file or directory
        at com.google.common.base.Throwables.propagate(Throwables.java:160)
        at com.google.common.util.concurrent.AbstractExecutionThreadService$1$1.run(AbstractExecutionThreadService.java:69)
        at java.lang.Thread.run(Thread.java:662)
Caused by: java.io.IOException: Cannot run program "node": java.io.IOException: error=2, No such file or directory
        at java.lang.ProcessBuilder.start(ProcessBuilder.java:470)
        at co.cask.cdap.WebCloudAppService.startUp(WebCloudAppService.java:57)
        at com.google.common.util.concurrent.AbstractExecutionThreadService$1$1.run(AbstractExecutionThreadService.java:47)
        ... 1 more
Caused by: java.io.IOException: java.io.IOException: error=2, No such file or directory
        at java.lang.UNIXProcess.<init>(UNIXProcess.java:148)
        at java.lang.ProcessImpl.start(ProcessImpl.java:65)
        at java.lang.ProcessBuilder.start(ProcessBuilder.java:452)
        ... 3 more
Failed to start singlenode. java.io.IOException: Cannot run program "node": java.io.IOException: error=2, No such file or directory
Exception in thread "WebCloudAppService" java.lang.RuntimeException: java.io.IOException: Cannot run program "node": java.io.IOException: error=2, No such file or directory
        at com.google.common.base.Throwables.propagate(Throwables.java:160)
        at com.google.common.util.concurrent.AbstractExecutionThreadService$1$1.run(AbstractExecutionThreadService.java:69)
        at java.lang.Thread.run(Thread.java:662)
Caused by: java.io.IOException: Cannot run program "node": java.io.IOException: error=2, No such file or directory
        at java.lang.ProcessBuilder.start(ProcessBuilder.java:470)
        at co.cask.cdap.WebCloudAppService.startUp(WebCloudAppService.java:57)
        at com.google.common.util.concurrent.AbstractExecutionThreadService$1$1.run(AbstractExecutionThreadService.java:47)
        ... 1 more
Caused by: java.io.IOException: java.io.IOException: error=2, No such file or directory
        at java.lang.UNIXProcess.<init>(UNIXProcess.java:148)
        at java.lang.ProcessImpl.start(ProcessImpl.java:65)
        at java.lang.ProcessBuilder.start(ProcessBuilder.java:452)
        ... 3 more
Aug 4, 2014 9:23:04 AM org.apache.commons.httpclient.auth.AuthChallengeProcessor selectAuthScheme
INFO: basic authentication scheme selected
Aug 4, 2014 9:23:04 AM org.apache.commons.httpclient.auth.AuthChallengeProcessor selectAuthScheme
INFO: basic authentication scheme selected
Aug 4, 2014 9:23:04 AM org.apache.commons.httpclient.auth.AuthChallengeProcessor selectAuthScheme
INFO: basic authentication scheme selected
Aug 4, 2014 9:23:04 AM org.apache.commons.httpclient.auth.AuthChallengeProcessor selectAuthScheme
INFO: basic authentication scheme selected
Aug 4, 2014 9:23:05 AM org.apache.commons.httpclient.auth.AuthChallengeProcessor selectAuthScheme
INFO: basic authentication scheme selected
Aug 4, 2014 9:23:05 AM org.apache.commons.httpclient.auth.AuthChallengeProcessor selectAuthScheme
INFO: basic authentication scheme selected
Aug 4, 2014 9:23:05 AM org.apache.commons.httpclient.auth.AuthChallengeProcessor selectAuthScheme
INFO: basic authentication scheme selected
Aug 4, 2014 9:23:05 AM org.apache.commons.httpclient.auth.AuthChallengeProcessor selectAuthScheme
INFO: basic authentication scheme selected
Aug 4, 2014 9:23:06 AM org.apache.commons.httpclient.auth.AuthChallengeProcessor selectAuthScheme
INFO: basic authentication scheme selected
Aug 4, 2014 9:23:06 AM org.apache.commons.httpclient.auth.AuthChallengeProcessor selectAuthScheme
INFO: basic authentication scheme selected
Aug 4, 2014 9:23:06 AM org.apache.commons.httpclient.auth.AuthChallengeProcessor selectAuthScheme
INFO: basic authentication scheme selected
Aug 4, 2014 9:23:06 AM org.apache.commons.httpclient.auth.AuthChallengeProcessor selectAuthScheme
INFO: basic authentication scheme selected
Aug 4, 2014 9:23:06 AM org.apache.commons.httpclient.auth.AuthChallengeProcessor selectAuthScheme
INFO: basic authentication scheme selected
Aug 4, 2014 9:23:13 AM org.apache.commons.httpclient.auth.AuthChallengeProcessor selectAuthScheme
INFO: basic authentication scheme selected
Aug 4, 2014 9:23:14 AM org.apache.commons.httpclient.auth.AuthChallengeProcessor selectAuthScheme
INFO: basic authentication scheme selected
Expanding: zipFile-902947390502563.zip into work
Expanding: zipFile-902966174038418.zip into /opt/bamboo/temp/CDAP-DUT-JOB1/junit1181999861947805978/junit8337332590643925395
OK