Build #884

Cask Data Application Platform - Develop Build and Test

Build: #884 failed Child of CDAP-DRC-1515

Build result summary

Details

Completed
Duration
59 minutes
Labels
None
Agent
bamboo-agent15
Revision
82739197bad995be69ffe8723f11f79c767c5730 82739197bad995be69ffe8723f11f79c767c5730
Total tests
1162
Fixed in
#885 (Child of CDAP-DRC-1516)

Responsible

Code commits

Author Commit Message Commit date
albertshau <albert@cask.co> albertshau <albert@cask.co> 82739197bad995be69ffe8723f11f79c767c5730 82739197bad995be69ffe8723f11f79c767c5730 Merge pull request #3566 from caskdata/feature/CDAP-3356-remove-deprecated-fields
CDAP-3356 remove deprecated 'id' field from RESTful APIs
Bhooshan Mogal Bhooshan Mogal 23ea1d16caa6b4ab7455c7fde5965c50158a561a 23ea1d16caa6b4ab7455c7fde5965c50158a561a Merge pull request #3564 from caskdata/bug/wiki-doc
[CDAP-3355] Fix typo in runtime argument for workflow
Bhooshan Mogal Bhooshan Mogal bfb0ad92a99326dd2a18a5afb4267e426e30cf19 bfb0ad92a99326dd2a18a5afb4267e426e30cf19 [CDAP-3355] Fix typo (use plural) in the runtime argument min.pages.workflow for the WikipediaPipelineWorkflow
Albert Shau <albert@cask.co> Albert Shau <albert@cask.co> c4aee5bb6cb93159f1844b3bd4d520e0f0c0faa5 c4aee5bb6cb93159f1844b3bd4d520e0f0c0faa5 CDAP-3356 remove deprecated 'id' field from RESTful APIs
More specifically, removing from the apps and programs RESTful
APIs. Id was deprecated because it always had the same value as
name. Also removing unused classes for streams and datasets.
ataylor4 <ataylor4@stanford.edu> ataylor4 <ataylor4@stanford.edu> 29884e476d9770b500930711259f58f51d8e5338 29884e476d9770b500930711259f58f51d8e5338 Merge pull request #3562 from caskdata/feature/CDAP-3352-fix
Updated Elasticsearch plugin documentation

Tests

New test failures 3
Status Test View job Duration
Collapse Failed AdapterLifecycleTest testBatchAdapterLifeCycle History
Unit Test Job < 1 sec
java.lang.AssertionError: expected:<1> but was:<4>
	at org.junit.Assert.fail(Assert.java:88)
	at org.junit.Assert.failNotEquals(Assert.java:743)
	at org.junit.Assert.assertEquals(Assert.java:118)
	at org.junit.Assert.assertEquals(Assert.java:555)
	at org.junit.Assert.assertEquals(Assert.java:542)
	at co.cask.cdap.internal.app.runtime.adapter.AdapterLifecycleTest.testAdapterLifeCycle(AdapterLifecycleTest.java:99)
	at co.cask.cdap.internal.app.runtime.adapter.AdapterLifecycleTest.testBatchAdapterLifeCycle(AdapterLifecycleTest.java:82)
Collapse Failed AdapterLifecycleTest testRealtimeAdapterLifeCycle History
Unit Test Job 1 sec
java.lang.NullPointerException: null
	at co.cask.cdap.internal.app.runtime.adapter.AdapterLifecycleTest.testAdapterLifeCycle(AdapterLifecycleTest.java:110)
	at co.cask.cdap.internal.app.runtime.adapter.AdapterLifecycleTest.testRealtimeAdapterLifeCycle(AdapterLifecycleTest.java:72)
Collapse Failed AdapterLifecycleTest testGetAllAdapters History
Unit Test Job 1 sec
java.lang.AssertionError: expected:<2> but was:<3>
	at org.junit.Assert.fail(Assert.java:88)
	at org.junit.Assert.failNotEquals(Assert.java:743)
	at org.junit.Assert.assertEquals(Assert.java:118)
	at org.junit.Assert.assertEquals(Assert.java:555)
	at org.junit.Assert.assertEquals(Assert.java:542)
	at co.cask.cdap.internal.app.runtime.adapter.AdapterLifecycleTest.testGetAllAdapters(AdapterLifecycleTest.java:239)

JIRA issues

IssueDescriptionStatus
Unknown Issue TypeCDAP-2780Could not obtain issue details from JIRA
Unknown Issue TypeCDAP-3355Could not obtain issue details from JIRA
Unknown Issue TypeCDAP-3356Could not obtain issue details from JIRA