Cask Data Application Platform - Develop Build and Test

Build: #3066 failed Child of CDAP-DRC-5089

Build result summary

Details

Completed
Duration
146 minutes
Labels
None
Agent
bamboo-agent06
Revision
73fe3dcf9c85549cbc6cf50a203286e5ceb8ca52 73fe3dcf9c85549cbc6cf50a203286e5ceb8ca52
Total tests
2859
Fixed in
#3067 (Child of CDAP-DRC-5091)

Responsible

Code commits

Author Commit Message Commit date
Ajai <1452845+ajainarayanan@users.noreply.github.com> Ajai <1452845+ajainarayanan@users.noreply.github.com> 73fe3dcf9c85549cbc6cf50a203286e5ceb8ca52 73fe3dcf9c85549cbc6cf50a203286e5ceb8ca52 Merge pull request #12777 from cdapio/bugfix-ui/fix-e2e-tests-ui-6.3
Fixes cypress config to have port name. This is used for generating t…
Ajai <1452845+ajainarayanan@users.noreply.github.com> Ajai <1452845+ajainarayanan@users.noreply.github.com> 7cb284105b3d58a97f00b4fc2758a9614615ac06 7cb284105b3d58a97f00b4fc2758a9614615ac06 Merge pull request #12776 from cdapio/bugfix-ui/CDAP-17258-6.3
Fixes plugin properties to be scrollable on smaller windows
Ajai Narayan Ajai Narayan f5f537adb15eaec5816770eb0ade08e696aaafc0 f5f537adb15eaec5816770eb0ade08e696aaafc0 Fixes SchemaParser to default keys in map type to string when not present
Ajai Narayan Ajai Narayan 7bb1b6ee4d42b1f3ae55da062c85c4a8145a2f6e 7bb1b6ee4d42b1f3ae55da062c85c4a8145a2f6e Adds additional check while copying nodes in pipeline canvas
Ajai Narayan Ajai Narayan 9b75ac54c4828ebdf191d3e929735fb7f0a7d5b3 9b75ac54c4828ebdf191d3e929735fb7f0a7d5b3 [CDAP-17624] Fixes schema editor to handle undefined schemas and default to an empty schema editor

Tests

New test failures 3
Status Test View job Duration
Collapse Failed PreviewDataPipelineTest testPreviewStop History
Unit Test Job 5 mins
java.util.concurrent.TimeoutException: Timeout occurred. Expected KILLED but found COMPLETED.
	at io.cdap.cdap.common.utils.Tasks.waitFor(Tasks.java:70)
	at io.cdap.cdap.common.utils.Tasks.waitFor(Tasks.java:91)
	at io.cdap.cdap.common.utils.Tasks.waitFor(Tasks.java:130)
	at io.cdap.cdap.datapipeline.preview.PreviewDataPipelineTest.testDataPipelinePreviewStop(PreviewDataPipelineTest.java:237)
	at io.cdap.cdap.datapipeline.preview.PreviewDataPipelineTest.testPreviewStop(PreviewDataPipelineTest.java:179)
	at sun.reflect.NativeMethodAccessorImpl.invoke0(Native Method)
	at sun.reflect.NativeMethodAccessorImpl.invoke(NativeMethodAccessorImpl.java:62)
(40 more lines...)
Collapse Failed PreviewDataPipelineTest testPreviewFailedRun History
Unit Test Job < 1 sec
io.cdap.cdap.api.dataset.InstanceConflictException: Failed to add instance singleInput due to conflict, details: Response code: 409, message: 'Conflict', body: ''dataset:default.singleInput' already exists'
	at io.cdap.cdap.data2.datafabric.dataset.DatasetServiceClient.addInstance(DatasetServiceClient.java:169)
	at io.cdap.cdap.data2.datafabric.dataset.RemoteDatasetFramework.addInstance(RemoteDatasetFramework.java:147)
	at io.cdap.cdap.data2.dataset2.ForwardingDatasetFramework.addInstance(ForwardingDatasetFramework.java:79)
	at io.cdap.cdap.data2.dataset2.DatasetFramework.addInstance(DatasetFramework.java:140)
	at io.cdap.cdap.test.UnitTestManager.addDatasetInstance(UnitTestManager.java:302)
	at io.cdap.cdap.test.TestBase.addDatasetInstance(TestBase.java:801)
	at io.cdap.cdap.test.TestBase.addDatasetInstance(TestBase.java:816)
(44 more lines...)
Collapse Failed PreviewDataPipelineTest testDataPipelinePreviewRuns History
Unit Test Job < 1 sec
io.cdap.cdap.api.dataset.InstanceConflictException: Failed to add instance singleInput due to conflict, details: Response code: 409, message: 'Conflict', body: ''dataset:default.singleInput' already exists'
	at io.cdap.cdap.data2.datafabric.dataset.DatasetServiceClient.addInstance(DatasetServiceClient.java:169)
	at io.cdap.cdap.data2.datafabric.dataset.RemoteDatasetFramework.addInstance(RemoteDatasetFramework.java:147)
	at io.cdap.cdap.data2.dataset2.ForwardingDatasetFramework.addInstance(ForwardingDatasetFramework.java:79)
	at io.cdap.cdap.data2.dataset2.DatasetFramework.addInstance(DatasetFramework.java:140)
	at io.cdap.cdap.test.UnitTestManager.addDatasetInstance(UnitTestManager.java:302)
	at io.cdap.cdap.test.TestBase.addDatasetInstance(TestBase.java:801)
	at io.cdap.cdap.test.TestBase.addDatasetInstance(TestBase.java:816)
(44 more lines...)

JIRA issues

IssueDescriptionStatus
Unknown Issue TypeCDAP-17624Could not obtain issue details from JIRA