Build #2,601

Cask Data Application Platform - Develop Build and Test

Build: #2601 failed Child of CDAP-DRC-4486

Build result summary

Details

Completed
Duration
68 minutes
Labels
None
Agent
bamboo-agent03
Revision
66bbaca677cecc738b7b7265d70d12096f7bbac2 66bbaca677cecc738b7b7265d70d12096f7bbac2
Total tests
1841
Fixed in
#2602 (Child of CDAP-DRC-4488)

Responsible

Code commits

Author Commit Message Commit date
Ajai <1452845+ajainarayanan@users.noreply.github.com> Ajai <1452845+ajainarayanan@users.noreply.github.com> 66bbaca677cecc738b7b7265d70d12096f7bbac2 66bbaca677cecc738b7b7265d70d12096f7bbac2 Merge pull request #11365 from cdapio/bugfix-ui/CDAP-15400
[CDAP-15400] Adds optional information icon for plugin configuration groups if provided
Ajai Narayan Ajai Narayan 4d23f4a8c7b1487b3967baa4912acac1b10d9b3c 4d23f4a8c7b1487b3967baa4912acac1b10d9b3c [CDAP-15400] Adds optional description for plugin configuration groups if provided
Ajai <1452845+ajainarayanan@users.noreply.github.com> Ajai <1452845+ajainarayanan@users.noreply.github.com> 7fa98d0e6ad7ed0bf36b09546625207bccffd2e3 7fa98d0e6ad7ed0bf36b09546625207bccffd2e3 Merge pull request #11386 from cdapio/feature-ui/CDAP-15416
[CDAP-15416] Migrates json-editor from angular to react in plugin configuration
Ajai Narayan Ajai Narayan 684bf69f3119c89917b7272539174422bd4352e6 684bf69f3119c89917b7272539174422bd4352e6 [CDAP-15416] Migrates json-editor from angular to react in plugin configuration
  - Updates react types to the latest
  - Updates CodeEditor to handle beautifying code
  - Adds JSONeditor for use in plugin configuration modal
  - Migrates angular json editor to react component
Miguel Velez <miguelvelez@google.com> Miguel Velez <miguelvelez@google.com> 3753a54e9c71dfa762a7599ad7b0bd3168cfd4f9 3753a54e9c71dfa762a7599ad7b0bd3168cfd4f9 Merge pull request #11369 from cdapio/bugfix/CDAP-15220-system-service-discovery
[CDAP-15220] Allow discovery of services running in system namespace

Tests

New test failures 8
Status Test View job Duration
Collapse Failed ProgramLifecycleHttpHandlerTest testProvisionerFailureStateAndMetrics History
Unit Test Job 2 secs
java.lang.AssertionError: expected:<200> but was:<409>
	at org.junit.Assert.fail(Assert.java:88)
	at org.junit.Assert.failNotEquals(Assert.java:743)
	at org.junit.Assert.assertEquals(Assert.java:118)
	at org.junit.Assert.assertEquals(Assert.java:555)
	at org.junit.Assert.assertEquals(Assert.java:542)
	at io.cdap.cdap.internal.app.services.http.handlers.ProgramLifecycleHttpHandlerTest.testProvisionerFailureStateAndMetrics(ProgramLifecycleHttpHandlerTest.java:533)
	at sun.reflect.NativeMethodAccessorImpl.invoke0(Native Method)
(44 more lines...)
Collapse Failed ProgramLifecycleHttpHandlerTest testStopProgramWhilePending History
Unit Test Job 1 min
java.lang.AssertionError: expected:<200> but was:<409>
	at org.junit.Assert.fail(Assert.java:88)
	at org.junit.Assert.failNotEquals(Assert.java:743)
	at org.junit.Assert.assertEquals(Assert.java:118)
	at org.junit.Assert.assertEquals(Assert.java:555)
	at org.junit.Assert.assertEquals(Assert.java:542)
	at io.cdap.cdap.internal.app.services.http.handlers.ProgramLifecycleHttpHandlerTest.testStopProgramWhilePending(ProgramLifecycleHttpHandlerTest.java:561)
	at sun.reflect.NativeMethodAccessorImpl.invoke0(Native Method)
(44 more lines...)
Collapse Failed ProgramLifecycleHttpHandlerTest testProgramStartStopStatus History
Unit Test Job 15 secs
java.lang.AssertionError: expected:<404> but was:<200>
	at org.junit.Assert.fail(Assert.java:88)
	at org.junit.Assert.failNotEquals(Assert.java:743)
	at org.junit.Assert.assertEquals(Assert.java:118)
	at org.junit.Assert.assertEquals(Assert.java:555)
	at org.junit.Assert.assertEquals(Assert.java:542)
	at io.cdap.cdap.internal.app.services.http.AppFabricTestBase.startProgram(AppFabricTestBase.java:835)
	at io.cdap.cdap.internal.app.services.http.AppFabricTestBase.startProgram(AppFabricTestBase.java:807)
(47 more lines...)
Collapse Failed ProgramLifecycleHttpHandlerTest testProgramList History
Unit Test Job < 1 sec
org.junit.ComparisonFailure: expected:<[[]]> but was:<[[{"type":"Workflow","app":"App","name":"NoOpWorkflow","description":"NoOp Workflow description"},{"type":"Workflow","app":"SleepWorkflowApp","name":"SleepWorkflow","description":"FunWorkflow description"}]]>
org.junit.ComparisonFailure: expected:<[[]]> but was:<[[{"type":"Workflow","app":"App","name":"NoOpWorkflow","description":"NoOp Workflow description"},{"type":"Workflow","app":"SleepWorkflowApp","name":"SleepWorkflow","description":"FunWorkflow description"}]]>	at org.junit.Assert.assertEquals(Assert.java:115)	at org.junit.Assert.assertEquals(Assert.java:144)	at io.cdap.cdap.internal.app.services.http.handlers.ProgramLifecycleHttpHandlerTest.testListInitialState(ProgramLifecycleHttpHandlerTest.java:1604)	at io.cdap.cdap.internal.app.services.http.handlers.ProgramLifecycleHttpHandlerTest.testProgramList(ProgramLifecycleHttpHandlerTest.java:851)	at sun.reflect.NativeMethodAccessorImpl.invoke0(Native Method)	at sun.reflect.NativeMethodAccessorImpl.invoke(NativeMethodAccessorImpl.java:62)	at sun.reflect.DelegatingMethodAccessorImpl.invoke(DelegatingMethodAccessorImpl.java:43)	at java.lang.reflect.Method.invoke(Method.java:498)	at org.junit.runners.model.FrameworkMethod$1.runReflectiveCall(FrameworkMethod.java:47)	at org.junit.internal.runners.model.ReflectiveCallable.run(ReflectiveCallable.java:12)	at org.junit.runners.model.FrameworkMethod.invokeExplosively(FrameworkMethod.java:44)	at org.junit.internal.runners.statements.InvokeMethod.evaluate(InvokeMethod.java:17)	at org.junit.internal.runners.statements.RunAfters.evaluate(RunAfters.java:27)	at org.junit.runners.ParentRunner.runLeaf(ParentRunner.java:271)	at org.junit.runners.BlockJUnit4ClassRunner.runChild(BlockJUnit4ClassRunner.java:70)	at org.junit.runners.BlockJUnit4ClassRunner.runChild(BlockJUnit4ClassRunner.java:50)	at org.junit.runners.ParentRunner$3.run(ParentRunner.java:238)	at org.junit.runners.ParentRunner$1.schedule(ParentRunner.java:63)	at org.junit.runners.ParentRunner.runChildren(ParentRunner.java:236)	at org.junit.runners.ParentRunner.access$000(ParentRunner.java:53)	at org.junit.runners.ParentRunner$2.evaluate(ParentRunner.java:229)	at org.junit.internal.runners.statements.RunBefores.evaluate(RunBefores.java:26)	at org.junit.internal.runners.statements.RunAfters.evaluate(RunAfters.java:27)	at org.junit.rules.ExternalResource$1.evaluate(ExternalResource.java:48)	at org.junit.rules.RunRules.evaluate(RunRules.java:20)	at org.junit.runners.ParentRunner.run(ParentRunner.java:309)	at org.junit.runners.Suite.runChild(Suite.java:127)	at org.junit.runners.Suite.runChild(Suite.java:26)	at org.junit.runners.ParentRunner$3.run(ParentRunner.java:238)	at org.junit.runners.ParentRunner$1.schedule(ParentRunner.java:63)	at org.junit.runners.ParentRunner.runChildren(ParentRunner.java:236)	at org.junit.runners.ParentRunner.access$000(ParentRunner.java:53)	at org.junit.runners.ParentRunner$2.evaluate(ParentRunner.java:229)	at org.junit.runners.ParentRunner.run(ParentRunner.java:309)	at org.junit.runner.JUnitCore.run(JUnitCore.java:160)	at org.junit.runner.JUnitCore.run(JUnitCore.java:138)	at org.apache.maven.surefire.junitcore.JUnitCoreWrapper.createReqestAndRun(JUnitCoreWrapper.java:139)	at org.apache.maven.surefire.junitcore.JUnitCoreWrapper.executeEager(JUnitCoreWrapper.java:111)	at org.apache.maven.surefire.junitcore.JUnitCoreWrapper.execute(JUnitCoreWrapper.java:84)	at org.apache.maven.surefire.junitcore.JUnitCoreProvider.invoke(JUnitCoreProvider.java:138)	at sun.reflect.NativeMethodAccessorImpl.invoke0(Native Method)	at sun.reflect.NativeMethodAccessorImpl.invoke(NativeMethodAccessorImpl.java:62)	at sun.reflect.DelegatingMethodAccessorImpl.invoke(DelegatingMethodAccessorImpl.java:43)	at java.lang.reflect.Method.invoke(Method.java:498)	at org.apache.maven.surefire.util.ReflectionUtils.invokeMethodWithArray2(ReflectionUtils.java:208)	at org.apache.maven.surefire.booter.ProviderFactory$ProviderProxy.invoke(ProviderFactory.java:159)	at org.apache.maven.surefire.booter.ProviderFactory.invokeProvider(ProviderFactory.java:87)	at org.apache.maven.surefire.booter.ForkedBooter.runSuitesInProcess(ForkedBooter.java:153)	at org.apache.maven.surefire.booter.ForkedBooter.main(ForkedBooter.java:95)
Collapse Failed ProgramLifecycleHttpHandlerTest testWorkflowHistory History
Unit Test Job 1 min
java.lang.AssertionError: expected:<200> but was:<409>
	at org.junit.Assert.fail(Assert.java:88)
	at org.junit.Assert.failNotEquals(Assert.java:743)
	at org.junit.Assert.assertEquals(Assert.java:118)
	at org.junit.Assert.assertEquals(Assert.java:555)
	at org.junit.Assert.assertEquals(Assert.java:542)
	at io.cdap.cdap.internal.app.services.http.handlers.ProgramLifecycleHttpHandlerTest.testWorkflowHistory(ProgramLifecycleHttpHandlerTest.java:496)
	at sun.reflect.NativeMethodAccessorImpl.invoke0(Native Method)
(44 more lines...)
Collapse Failed ProgramLifecycleHttpHandlerTest testStopProgramRunWhilePending History
Unit Test Job 1 min
java.lang.AssertionError: expected:<200> but was:<409>
	at org.junit.Assert.fail(Assert.java:88)
	at org.junit.Assert.failNotEquals(Assert.java:743)
	at org.junit.Assert.assertEquals(Assert.java:118)
	at org.junit.Assert.assertEquals(Assert.java:555)
	at org.junit.Assert.assertEquals(Assert.java:542)
	at io.cdap.cdap.internal.app.services.http.handlers.ProgramLifecycleHttpHandlerTest.testStopProgramRunWhilePending(ProgramLifecycleHttpHandlerTest.java:592)
	at sun.reflect.NativeMethodAccessorImpl.invoke0(Native Method)
(44 more lines...)
Collapse Failed ProgramLifecycleHttpHandlerTest testProgramStartStopStatusErrors History
Unit Test Job 57 secs
java.lang.AssertionError: expected:<200> but was:<409>
	at org.junit.Assert.fail(Assert.java:88)
	at org.junit.Assert.failNotEquals(Assert.java:743)
	at org.junit.Assert.assertEquals(Assert.java:118)
	at org.junit.Assert.assertEquals(Assert.java:555)
	at org.junit.Assert.assertEquals(Assert.java:542)
	at io.cdap.cdap.internal.app.services.http.handlers.ProgramLifecycleHttpHandlerTest.testProgramStartStopStatusErrors(ProgramLifecycleHttpHandlerTest.java:427)
	at sun.reflect.NativeMethodAccessorImpl.invoke0(Native Method)
(44 more lines...)
Collapse Failed ProgramLifecycleHttpHandlerTest io.cdap.cdap.internal.app.services.http.handlers.ProgramLifecycleHttpHandlerTest History
Unit Test Job 13 secs
java.util.concurrent.TimeoutException: Timeout occurred. Expected 200 but found 409.
	at io.cdap.cdap.common.utils.Tasks.waitFor(Tasks.java:70)
	at io.cdap.cdap.common.utils.Tasks.waitFor(Tasks.java:91)
	at io.cdap.cdap.common.utils.Tasks.waitFor(Tasks.java:130)
	at io.cdap.cdap.internal.app.services.http.AppFabricTestBase.deleteNamespaces(AppFabricTestBase.java:958)
	at io.cdap.cdap.internal.app.services.http.AppFabricTestBase.afterClass(AppFabricTestBase.java:300)
	at sun.reflect.NativeMethodAccessorImpl.invoke0(Native Method)
	at sun.reflect.NativeMethodAccessorImpl.invoke(NativeMethodAccessorImpl.java:62)
(32 more lines...)

JIRA issues

IssueDescriptionStatus
Unknown Issue TypeCDAP-15220Could not obtain issue details from JIRA
Unknown Issue TypeCDAP-15400Could not obtain issue details from JIRA
Unknown Issue TypeCDAP-15416Could not obtain issue details from JIRA