Build #2,477

Cask Data Application Platform - Develop Build and Test

Build: #2477 failed Child of CDAP-DRC-4279

Test results

  • 2,386 tests in total
  • 3 tests failed
  • 3 failures are new
  • 14 tests were quarantined / skipped
  • 76 minutes taken in total.
New test failures 3
Status Test View job Duration
Collapse Failed AppFabricServiceMainTest co.cask.cdap.master.environment.k8s.AppFabricServiceMainTest History
Unit Test Job < 1 sec
com.google.common.util.concurrent.UncheckedExecutionException: java.lang.ClassCastException: co.cask.cdap.data2.dataset2.lib.table.leveldb.LevelDBTable cannot be cast to co.cask.cdap.data2.dataset2.lib.table.MetricsTable
	at com.google.common.cache.LocalCache$Segment.get(LocalCache.java:2258)
	at com.google.common.cache.LocalCache.get(LocalCache.java:3990)
	at com.google.common.cache.LocalCache.getOrLoad(LocalCache.java:3994)
	at com.google.common.cache.LocalCache$LocalLoadingCache.get(LocalCache.java:4878)
	at com.google.common.cache.LocalCache$LocalLoadingCache.getUnchecked(LocalCache.java:4884)
	at co.cask.cdap.data2.nosql.NoSqlStructuredTableRegistry.getSpecification(NoSqlStructuredTableRegistry.java:114)
	at co.cask.cdap.data2.nosql.NoSqlStructuredTableAdmin.getSpecification(NoSqlStructuredTableAdmin.java:81)
(49 more lines...)
Collapse Failed MessagingServiceMainTest co.cask.cdap.master.environment.k8s.MessagingServiceMainTest History
Unit Test Job < 1 sec
com.google.common.util.concurrent.UncheckedExecutionException: java.lang.ClassCastException: co.cask.cdap.data2.dataset2.lib.table.leveldb.LevelDBTable cannot be cast to co.cask.cdap.data2.dataset2.lib.table.MetricsTable
	at com.google.common.cache.LocalCache$Segment.get(LocalCache.java:2258)
	at com.google.common.cache.LocalCache.get(LocalCache.java:3990)
	at com.google.common.cache.LocalCache.getOrLoad(LocalCache.java:3994)
	at com.google.common.cache.LocalCache$LocalLoadingCache.get(LocalCache.java:4878)
	at com.google.common.cache.LocalCache$LocalLoadingCache.getUnchecked(LocalCache.java:4884)
	at co.cask.cdap.data2.nosql.NoSqlStructuredTableRegistry.getSpecification(NoSqlStructuredTableRegistry.java:114)
	at co.cask.cdap.data2.nosql.NoSqlStructuredTableAdmin.getSpecification(NoSqlStructuredTableAdmin.java:81)
(49 more lines...)
Collapse Failed MetricsServiceMainTest co.cask.cdap.master.environment.k8s.MetricsServiceMainTest History
Unit Test Job < 1 sec
com.google.common.util.concurrent.UncheckedExecutionException: java.lang.ClassCastException: co.cask.cdap.data2.dataset2.lib.table.leveldb.LevelDBTable cannot be cast to co.cask.cdap.data2.dataset2.lib.table.MetricsTable
	at com.google.common.cache.LocalCache$Segment.get(LocalCache.java:2258)
	at com.google.common.cache.LocalCache.get(LocalCache.java:3990)
	at com.google.common.cache.LocalCache.getOrLoad(LocalCache.java:3994)
	at com.google.common.cache.LocalCache$LocalLoadingCache.get(LocalCache.java:4878)
	at com.google.common.cache.LocalCache$LocalLoadingCache.getUnchecked(LocalCache.java:4884)
	at co.cask.cdap.data2.nosql.NoSqlStructuredTableRegistry.getSpecification(NoSqlStructuredTableRegistry.java:114)
	at co.cask.cdap.data2.nosql.NoSqlStructuredTableAdmin.getSpecification(NoSqlStructuredTableAdmin.java:81)
(49 more lines...)
Skipped tests 14
Status Test Failing since View job
Skipped AltStyleTableRendererTest co.cask.cdap.cli.util.table.AltStyleTableRendererTest History
Unit Test Job
Skipped CsvTableRendererTest co.cask.cdap.cli.util.table.CsvTableRendererTest History
Unit Test Job
Skipped SyncTest testSync History
Unit Test Job
Skipped HBaseTableTest testEmptyValuePut History
Unit Test Job
Skipped InMemoryTableTest testEmptyValuePut History
Unit Test Job
Skipped LevelDBTableTest testEmptyValuePut History
Unit Test Job
Skipped WorkflowHttpHandlerTest testWorkflowForkFailure History
Unit Test Job
Skipped WorkflowHttpHandlerTest testWorkflowSchedules History
Unit Test Job
Skipped ASMDatumCodecTest testSpeed History
Unit Test Job
Skipped KubeDiscoveryServiceTest co.cask.cdap.k8s.discovery.KubeDiscoveryServiceTest History
Unit Test Job
Skipped EntityIdTest printToJson History
Unit Test Job
Skipped EntityIdTest printToString History
Unit Test Job
Skipped ApplicationSecurityTest testAbilityToSetSecurityManagerMultipleTimes History
Unit Test Job
Skipped TestFrameworkTestRun testDeployWorkflowApp History
Unit Test Job