Build #2,247

Cask Data Application Platform - Develop Build and Test

Build: #2247 failed Child of CDAP-DRC-3930

Build result summary

Details

Completed
Duration
57 minutes
Labels
None
Agent
bamboo-agent15
Revision
d720881b0f9358a3d4d9273b47368763c93e0af9 d720881b0f9358a3d4d9273b47368763c93e0af9
Total tests
1765
Fixed in
#2260 (Child of CDAP-DRC-3954)

Responsible

Code commits

Author Commit Message Commit date
Sreevatsan Raman Sreevatsan Raman d720881b0f9358a3d4d9273b47368763c93e0af9 d720881b0f9358a3d4d9273b47368763c93e0af9 Merge pull request #10476 from caskdata/release/5.0
Merge release/5.0 to develop
Sreevatsan Raman Sreevatsan Raman 47da6de35359b1129f4a512f43967529cba7437d m 47da6de35359b1129f4a512f43967529cba7437d Merge pull request #10481 from caskdata/feature/license
License update for 5.0
Rohit Sinha <rosinha@google.com> Rohit Sinha <rosinha@google.com> 103a980f9a4284bc48b3a0b566f80e382ebaad5a m 103a980f9a4284bc48b3a0b566f80e382ebaad5a Update license for release 5.0
Sreevatsan Raman Sreevatsan Raman 1d43c2702166141d6dd7e3dfd7ff992c47db36f5 m 1d43c2702166141d6dd7e3dfd7ff992c47db36f5 Merge pull request #10474 from caskdata/bugfix_release/CDAP-13857-add-upgrade-doc
CDAP-13942 Upgrade schedule.store and job.queue datasets
Sreevatsan Raman Sreevatsan Raman 232c9cd19d10de3c5a0ed7c92f7556f1249544d1 m 232c9cd19d10de3c5a0ed7c92f7556f1249544d1 Merge pull request #10459 from caskdata/feature/ops-dashboard-docs
CDAP-13147 documentation on operations dashboard and reporting

Tests

New test failures 1
Status Test View job Duration
Collapse Failed FlowTest testFlow History
Unit Test Job 1 min
java.util.concurrent.ExecutionException: java.lang.RuntimeException: org.apache.tephra.TransactionNotInProgressException: canCommit() is called for transaction 1532836171938000000 that is not in progress (it is known to be invalid)
	at com.google.common.util.concurrent.AbstractFuture$Sync.getValue(AbstractFuture.java:294)
	at com.google.common.util.concurrent.AbstractFuture$Sync.get(AbstractFuture.java:281)
	at com.google.common.util.concurrent.AbstractFuture.get(AbstractFuture.java:116)
	at co.cask.cdap.internal.AppFabricTestHelper.deployApplicationWithManager(AppFabricTestHelper.java:246)
	at co.cask.cdap.internal.AppFabricTestHelper.deployApplicationWithManager(AppFabricTestHelper.java:228)
	at co.cask.cdap.internal.AppFabricTestHelper.deployApplicationWithManager(AppFabricTestHelper.java:217)
	at co.cask.cdap.runtime.FlowTest.testFlow(FlowTest.java:156)
(67 more lines...)

JIRA issues

IssueDescriptionStatus
28 more issues…
Unknown Issue TypeCDAP-5Could not obtain issue details from JIRA
Unknown Issue TypeCDAP-12249Could not obtain issue details from JIRA
Unknown Issue TypeCDAP-13088Could not obtain issue details from JIRA
Unknown Issue TypeCDAP-13099Could not obtain issue details from JIRA
Unknown Issue TypeCDAP-13147Could not obtain issue details from JIRA