Build #2,228

Cask Data Application Platform - Develop Build and Test

Build: #2228 failed Child of CDAP-DRC-3891

Build result summary

Details

Completed
Duration
192 minutes
Labels
None
Agent
bamboo-agent19
Revision
a0b70020e8fc1a01ccd5ec326baafcc4c0960925 a0b70020e8fc1a01ccd5ec326baafcc4c0960925
Total tests
2432
Fixed in
#2230 (Child of CDAP-DRC-3894)

Responsible

No one has taken responsibility for this failure

Code commits

Author Commit Message Commit date
yaojiefeng <yaojie@google.com> yaojiefeng <yaojie@google.com> a0b70020e8fc1a01ccd5ec326baafcc4c0960925 a0b70020e8fc1a01ccd5ec326baafcc4c0960925 Merge pull request #10223 from caskdata/feature/CDAP-13432-publish-to-tms-to-update-metadata
CDAP-13432 publish event to tms to update profile metadata
yaojie <yaojie@google.com> yaojie <yaojie@google.com> 44bd84a4f136e8cf263214d54340a042b6aabebd m 44bd84a4f136e8cf263214d54340a042b6aabebd CDAP-13432 publish event to tms to update profile metadata
sagarkapare <sagarkapare@google.com> sagarkapare <sagarkapare@google.com> 81fcfcad7ffd3a6c640c1cffcbf27311015164d0 81fcfcad7ffd3a6c640c1cffcbf27311015164d0 Merge pull request #10237 from caskdata/feature/CDAP-fix-fll-lineage-handler-routing
CDAP-13601 Added rules for field lineage endpoints in RouterPathLookup.
sagarkapare <sagarkapare@google.com> sagarkapare <sagarkapare@google.com> 8ae3cb95063417de631e65e519e153120cb7047e m 8ae3cb95063417de631e65e519e153120cb7047e CDAP-13601 Added rules for field lineage endpoints in RouterPathLookup.
Chengfeng Mao <chengfeng@google.com> Chengfeng Mao <chengfeng@google.com> 79ccb5eec9163dcf2d19f4a8343a52502693b7da 79ccb5eec9163dcf2d19f4a8343a52502693b7da Merge pull request #10239 from caskdata/feature/CDAP-13609-fix-metric-processor-test
[CDAP-13609] fix flaky MessagingMetricsProcessorServiceTest

Configuration changes

Plan configuration has changed since the last successful build. See the plan audit log for more details.

Tests

New test failures 4
Status Test View job Duration
Collapse Failed MetadataHttpHandlerTestRun testSystemScopeArtifacts History
Unit Test Job 1 sec
java.lang.AssertionError: expected:<[MetadataSearchResultRecord{entityId=artifact:system.wordcount.1.0.0, metadata={}}]> but was:<[MetadataSearchResultRecord{entityId=artifact:system.wordcount.1.0.0, metadata={}}, MetadataSearchResultRecord{entityId=schedule:default.FakeApp.-SNAPSHOT.someSchedule, metadata={}}]>
	at org.junit.Assert.fail(Assert.java:88)
	at org.junit.Assert.failNotEquals(Assert.java:743)
	at org.junit.Assert.assertEquals(Assert.java:118)
	at org.junit.Assert.assertEquals(Assert.java:144)
	at co.cask.cdap.client.MetadataHttpHandlerTestRun.testSystemScopeArtifacts(MetadataHttpHandlerTestRun.java:857)
	at sun.reflect.NativeMethodAccessorImpl.invoke0(Native Method)
	at sun.reflect.NativeMethodAccessorImpl.invoke(NativeMethodAccessorImpl.java:62)
(56 more lines...)
Collapse Failed MetadataHttpHandlerTestRun testSearchMetadataDelete History
Unit Test Job 2 secs
java.lang.AssertionError: expected:<[MetadataSearchResultRecord{entityId=application:ns1.WordCountApp.-SNAPSHOT, metadata={}}, MetadataSearchResultRecord{entityId=program:ns1.WordCountApp.-SNAPSHOT.flow.WordCountFlow, metadata={}}, MetadataSearchResultRecord{entityId=artifact:ns1.WordCountApp.1.0, metadata={}}, MetadataSearchResultRecord{entityId=program:ns1.WordCountApp.-SNAPSHOT.service.WordFrequencyService, metadata={}}]> but was:<[MetadataSearchResultRecord{entityId=application:ns1.WordCountApp.-SNAPSHOT, metadata={}}, MetadataSearchResultRecord{entityId=program:ns1.WordCountApp.-SNAPSHOT.flow.WordCountFlow, metadata={}}, MetadataSearchResultRecord{entityId=artifact:system.wordcount.1.0.0, metadata={}}, MetadataSearchResultRecord{entityId=program:ns1.WordCountApp.-SNAPSHOT.service.WordFrequencyService, metadata={}}, MetadataSearchResultRecord{entityId=artifact:ns1.WordCountApp.1.0, metadata={}}]>
	at org.junit.Assert.fail(Assert.java:88)
	at org.junit.Assert.failNotEquals(Assert.java:743)
	at org.junit.Assert.assertEquals(Assert.java:118)
	at org.junit.Assert.assertEquals(Assert.java:144)
	at co.cask.cdap.client.MetadataHttpHandlerTestRun.testSearchMetadataDelete(MetadataHttpHandlerTestRun.java:1087)
	at sun.reflect.NativeMethodAccessorImpl.invoke0(Native Method)
	at sun.reflect.NativeMethodAccessorImpl.invoke(NativeMethodAccessorImpl.java:62)
(56 more lines...)
Collapse Failed MetadataHttpHandlerTestRun testSearchResultPagination History
Unit Test Job 1 sec
java.lang.AssertionError: expected:<[MetadataSearchResultRecord{entityId=dataset:pagination._auditLog, metadata={}}, MetadataSearchResultRecord{entityId=dataset:pagination.mydataset, metadata={}}, MetadataSearchResultRecord{entityId=stream:pagination.text, metadata={}}, MetadataSearchResultRecord{entityId=stream_view:pagination.text.view, metadata={}}]> but was:<[MetadataSearchResultRecord{entityId=dataset:pagination._auditLog, metadata={}}, MetadataSearchResultRecord{entityId=dataset:pagination.mydataset, metadata={}}, MetadataSearchResultRecord{entityId=stream:pagination.text, metadata={}}, MetadataSearchResultRecord{entityId=stream_view:pagination.text.view, metadata={}}, MetadataSearchResultRecord{entityId=artifact:system.wordcount.1.0.0, metadata={}}]>
	at org.junit.Assert.fail(Assert.java:88)
	at org.junit.Assert.failNotEquals(Assert.java:743)
	at org.junit.Assert.assertEquals(Assert.java:118)
	at org.junit.Assert.assertEquals(Assert.java:144)
	at co.cask.cdap.client.MetadataHttpHandlerTestRun.testSearchResultPagination(MetadataHttpHandlerTestRun.java:1383)
	at sun.reflect.NativeMethodAccessorImpl.invoke0(Native Method)
	at sun.reflect.NativeMethodAccessorImpl.invoke(NativeMethodAccessorImpl.java:62)
(56 more lines...)
Collapse Failed WebAnalyticsTest testWebAnalytics History
Unit Test Job 1 min
java.lang.IllegalStateException: Expected 200 OK, got 400 Bad Request. Error: Failed to deploy app
	at co.cask.cdap.internal.AppFabricClient.verifyResponse(AppFabricClient.java:453)
	at co.cask.cdap.internal.AppFabricClient.deployApplication(AppFabricClient.java:519)
	at co.cask.cdap.internal.AppFabricClient.deployApplication(AppFabricClient.java:501)
	at co.cask.cdap.test.UnitTestManager.deployApplication(UnitTestManager.java:191)
	at co.cask.cdap.test.TestBase.deployApplication(TestBase.java:560)
	at co.cask.cdap.test.TestBase.deployApplication(TestBase.java:543)
	at co.cask.cdap.test.TestBase.deployApplication(TestBase.java:576)
(49 more lines...)

JIRA issues

IssueDescriptionStatus
Unknown Issue TypeCDAP-13432Could not obtain issue details from JIRA
Unknown Issue TypeCDAP-13601Could not obtain issue details from JIRA
Unknown Issue TypeCDAP-13609Could not obtain issue details from JIRA