Build #222

Cask Data Application Platform - Develop Build and Test

Build: #222 failed Child of CDAP-DRC-221

Build result summary

Details

Completed
Duration
64 minutes
Labels
None
Revision
e7517688b9097e6432496fc6e77d00a5fccaf3c9 e7517688b9097e6432496fc6e77d00a5fccaf3c9
Total tests
950
Fixed in
#223 (Child of CDAP-DRC-222)

Responsible

  • albert albert Automatically assigned

Code commits

Author Commit Message Commit date
albertshau <albert@cask.co> albertshau <albert@cask.co> e7517688b9097e6432496fc6e77d00a5fccaf3c9 e7517688b9097e6432496fc6e77d00a5fccaf3c9 Merge pull request #900 from cybervisiontech/CDAP-708
CDAP-708: Refactor CDAP system HttpHandler implementations to use @QueryParam and @HeaderParam
Artem Makogon <artemmakogon@cask.co> Artem Makogon <artemmakogon@cask.co> 1bee46de101ee8d5a7eac3b68f60106dc3d6c85f m 1bee46de101ee8d5a7eac3b68f60106dc3d6c85f CDAP-708: resolved merge conflicts
Artem Makogon <artemmakogon@cask.co> Artem Makogon <artemmakogon@cask.co> 006002b58a421ccb19558817248bdeb82174e050 m 006002b58a421ccb19558817248bdeb82174e050 CDAP-708: refactored handlers to use QueryParams

Tests

New test failures 18
Status Test View job Duration
Collapse Failed ExploreExtensiveSchemaTableTestRun testExtensiveSchema History
Unit Test Job < 1 sec
java.util.concurrent.ExecutionException: co.cask.cdap.explore.service.ExploreException: Cannot execute query. Reason: Response code: 500, message:'Internal Server Error', body: ''
	at co.cask.cdap.explore.client.ExploreHttpClient.execute(ExploreHttpClient.java:132)
	at co.cask.cdap.explore.client.AbstractExploreClient.execute(AbstractExploreClient.java:56)
	at co.cask.cdap.explore.client.AbstractExploreClient$5.getHandle(AbstractExploreClient.java:133)
	at co.cask.cdap.explore.client.AbstractExploreClient$14.call(AbstractExploreClient.java:234)
	at co.cask.cdap.explore.client.AbstractExploreClient$14.call(AbstractExploreClient.java:231)
	at java.util.concurrent.FutureTask$Sync.innerRun(FutureTask.java:303)
	at java.util.concurrent.FutureTask.run(FutureTask.java:138)
(8 more lines...)
Collapse Failed HiveExploreServiceStreamTest testJoinOnStreams History
Unit Test Job 1 sec
java.util.concurrent.ExecutionException: co.cask.cdap.explore.service.ExploreException: Cannot execute query. Reason: Response code: 500, message:'Internal Server Error', body: ''
	at co.cask.cdap.explore.client.ExploreHttpClient.execute(ExploreHttpClient.java:132)
	at co.cask.cdap.explore.client.AbstractExploreClient.execute(AbstractExploreClient.java:56)
	at co.cask.cdap.explore.client.AbstractExploreClient$5.getHandle(AbstractExploreClient.java:133)
	at co.cask.cdap.explore.client.AbstractExploreClient$14.call(AbstractExploreClient.java:234)
	at co.cask.cdap.explore.client.AbstractExploreClient$14.call(AbstractExploreClient.java:231)
	at java.util.concurrent.FutureTask$Sync.innerRun(FutureTask.java:303)
	at java.util.concurrent.FutureTask.run(FutureTask.java:138)
(8 more lines...)
Collapse Failed HiveExploreServiceStreamTest testSelectStarOnStream History
Unit Test Job < 1 sec
java.util.concurrent.ExecutionException: co.cask.cdap.explore.service.ExploreException: Cannot execute query. Reason: Response code: 500, message:'Internal Server Error', body: ''
	at co.cask.cdap.explore.client.ExploreHttpClient.execute(ExploreHttpClient.java:132)
	at co.cask.cdap.explore.client.AbstractExploreClient.execute(AbstractExploreClient.java:56)
	at co.cask.cdap.explore.client.AbstractExploreClient$5.getHandle(AbstractExploreClient.java:133)
	at co.cask.cdap.explore.client.AbstractExploreClient$14.call(AbstractExploreClient.java:234)
	at co.cask.cdap.explore.client.AbstractExploreClient$14.call(AbstractExploreClient.java:231)
	at java.util.concurrent.FutureTask$Sync.innerRun(FutureTask.java:303)
	at java.util.concurrent.FutureTask.run(FutureTask.java:138)
(8 more lines...)
Collapse Failed HiveExploreServiceStreamTest testSelectFieldOnStream History
Unit Test Job < 1 sec
java.util.concurrent.ExecutionException: co.cask.cdap.explore.service.ExploreException: Cannot execute query. Reason: Response code: 500, message:'Internal Server Error', body: ''
	at co.cask.cdap.explore.client.ExploreHttpClient.execute(ExploreHttpClient.java:132)
	at co.cask.cdap.explore.client.AbstractExploreClient.execute(AbstractExploreClient.java:56)
	at co.cask.cdap.explore.client.AbstractExploreClient$5.getHandle(AbstractExploreClient.java:133)
	at co.cask.cdap.explore.client.AbstractExploreClient$14.call(AbstractExploreClient.java:234)
	at co.cask.cdap.explore.client.AbstractExploreClient$14.call(AbstractExploreClient.java:231)
	at java.util.concurrent.FutureTask$Sync.innerRun(FutureTask.java:303)
	at java.util.concurrent.FutureTask.run(FutureTask.java:138)
(8 more lines...)
Collapse Failed HiveExploreServiceStreamTest testSelectAndFilterQueryOnStream History
Unit Test Job < 1 sec
java.util.concurrent.ExecutionException: co.cask.cdap.explore.service.ExploreException: Cannot execute query. Reason: Response code: 500, message:'Internal Server Error', body: ''
	at co.cask.cdap.explore.client.ExploreHttpClient.execute(ExploreHttpClient.java:132)
	at co.cask.cdap.explore.client.AbstractExploreClient.execute(AbstractExploreClient.java:56)
	at co.cask.cdap.explore.client.AbstractExploreClient$5.getHandle(AbstractExploreClient.java:133)
	at co.cask.cdap.explore.client.AbstractExploreClient$14.call(AbstractExploreClient.java:234)
	at co.cask.cdap.explore.client.AbstractExploreClient$14.call(AbstractExploreClient.java:231)
	at java.util.concurrent.FutureTask$Sync.innerRun(FutureTask.java:303)
	at java.util.concurrent.FutureTask.run(FutureTask.java:138)
(8 more lines...)
Collapse Failed HiveExploreServiceStreamTest testStreamDefaultSchema History
Unit Test Job < 1 sec
java.util.concurrent.ExecutionException: co.cask.cdap.explore.service.ExploreException: Cannot execute query. Reason: Response code: 500, message:'Internal Server Error', body: ''
	at co.cask.cdap.explore.client.ExploreHttpClient.execute(ExploreHttpClient.java:132)
	at co.cask.cdap.explore.client.AbstractExploreClient.execute(AbstractExploreClient.java:56)
	at co.cask.cdap.explore.client.AbstractExploreClient$5.getHandle(AbstractExploreClient.java:133)
	at co.cask.cdap.explore.client.AbstractExploreClient$14.call(AbstractExploreClient.java:234)
	at co.cask.cdap.explore.client.AbstractExploreClient$14.call(AbstractExploreClient.java:231)
	at java.util.concurrent.FutureTask$Sync.innerRun(FutureTask.java:303)
	at java.util.concurrent.FutureTask.run(FutureTask.java:138)
(8 more lines...)
Collapse Failed HiveExploreServiceTestRun getDatasetSchemaTest History
Unit Test Job < 1 sec
java.util.concurrent.ExecutionException: co.cask.cdap.explore.service.ExploreException: Cannot execute query. Reason: Response code: 500, message:'Internal Server Error', body: ''
	at co.cask.cdap.explore.client.ExploreHttpClient.execute(ExploreHttpClient.java:132)
	at co.cask.cdap.explore.client.AbstractExploreClient.execute(AbstractExploreClient.java:56)
	at co.cask.cdap.explore.client.AbstractExploreClient$5.getHandle(AbstractExploreClient.java:133)
	at co.cask.cdap.explore.client.AbstractExploreClient$14.call(AbstractExploreClient.java:234)
	at co.cask.cdap.explore.client.AbstractExploreClient$14.call(AbstractExploreClient.java:231)
	at java.util.concurrent.FutureTask$Sync.innerRun(FutureTask.java:303)
	at java.util.concurrent.FutureTask.run(FutureTask.java:138)
(8 more lines...)
Collapse Failed HiveExploreServiceTestRun testHiveIntegration History
Unit Test Job < 1 sec
java.util.concurrent.ExecutionException: co.cask.cdap.explore.service.ExploreException: Cannot execute query. Reason: Response code: 500, message:'Internal Server Error', body: ''
	at co.cask.cdap.explore.client.ExploreHttpClient.execute(ExploreHttpClient.java:132)
	at co.cask.cdap.explore.client.AbstractExploreClient.execute(AbstractExploreClient.java:56)
	at co.cask.cdap.explore.client.AbstractExploreClient$5.getHandle(AbstractExploreClient.java:133)
	at co.cask.cdap.explore.client.AbstractExploreClient$14.call(AbstractExploreClient.java:234)
	at co.cask.cdap.explore.client.AbstractExploreClient$14.call(AbstractExploreClient.java:231)
	at java.util.concurrent.FutureTask$Sync.innerRun(FutureTask.java:303)
	at java.util.concurrent.FutureTask.run(FutureTask.java:138)
(8 more lines...)
Collapse Failed HiveExploreServiceTestRun getUserTables History
Unit Test Job < 1 sec
java.util.concurrent.ExecutionException: co.cask.cdap.explore.service.ExploreException: Cannot execute query. Reason: Response code: 500, message:'Internal Server Error', body: ''
	at co.cask.cdap.explore.client.ExploreHttpClient.execute(ExploreHttpClient.java:132)
	at co.cask.cdap.explore.client.AbstractExploreClient.execute(AbstractExploreClient.java:56)
	at co.cask.cdap.explore.client.AbstractExploreClient$5.getHandle(AbstractExploreClient.java:133)
	at co.cask.cdap.explore.client.AbstractExploreClient$14.call(AbstractExploreClient.java:234)
	at co.cask.cdap.explore.client.AbstractExploreClient$14.call(AbstractExploreClient.java:231)
	at java.util.concurrent.FutureTask$Sync.innerRun(FutureTask.java:303)
	at java.util.concurrent.FutureTask.run(FutureTask.java:138)
(8 more lines...)
Collapse Failed HiveExploreServiceTestRun exploreDriverTest History
Unit Test Job < 1 sec
java.sql.SQLException: co.cask.cdap.explore.service.ExploreException: Cannot execute query. Reason: Response code: 500, message:'Internal Server Error', body: ''
	at co.cask.cdap.explore.client.ExploreHttpClient.execute(ExploreHttpClient.java:132)
	at co.cask.cdap.explore.client.AbstractExploreClient.execute(AbstractExploreClient.java:56)
	at co.cask.cdap.explore.client.AbstractExploreClient$5.getHandle(AbstractExploreClient.java:133)
	at co.cask.cdap.explore.client.AbstractExploreClient$14.call(AbstractExploreClient.java:234)
	at co.cask.cdap.explore.client.AbstractExploreClient$14.call(AbstractExploreClient.java:231)
	at java.util.concurrent.FutureTask$Sync.innerRun(FutureTask.java:303)
	at java.util.concurrent.FutureTask.run(FutureTask.java:138)
(8 more lines...)
Collapse Failed HiveExploreServiceTestRun testJoin History
Unit Test Job < 1 sec
java.util.concurrent.ExecutionException: co.cask.cdap.explore.service.ExploreException: Cannot execute query. Reason: Response code: 500, message:'Internal Server Error', body: ''
	at co.cask.cdap.explore.client.ExploreHttpClient.execute(ExploreHttpClient.java:132)
	at co.cask.cdap.explore.client.AbstractExploreClient.execute(AbstractExploreClient.java:56)
	at co.cask.cdap.explore.client.AbstractExploreClient$5.getHandle(AbstractExploreClient.java:133)
	at co.cask.cdap.explore.client.AbstractExploreClient$14.call(AbstractExploreClient.java:234)
	at co.cask.cdap.explore.client.AbstractExploreClient$14.call(AbstractExploreClient.java:231)
	at java.util.concurrent.FutureTask$Sync.innerRun(FutureTask.java:303)
	at java.util.concurrent.FutureTask.run(FutureTask.java:138)
(8 more lines...)
Collapse Failed HiveExploreServiceTestRun queriesListTest History
Unit Test Job < 1 sec
java.util.concurrent.ExecutionException: co.cask.cdap.explore.service.ExploreException: Cannot execute query. Reason: Response code: 500, message:'Internal Server Error', body: ''
	at co.cask.cdap.explore.client.ExploreHttpClient.execute(ExploreHttpClient.java:132)
	at co.cask.cdap.explore.client.AbstractExploreClient.execute(AbstractExploreClient.java:56)
	at co.cask.cdap.explore.client.AbstractExploreClient$5.getHandle(AbstractExploreClient.java:133)
	at co.cask.cdap.explore.client.AbstractExploreClient$14.call(AbstractExploreClient.java:234)
	at co.cask.cdap.explore.client.AbstractExploreClient$14.call(AbstractExploreClient.java:231)
	at java.util.concurrent.FutureTask$Sync.innerRun(FutureTask.java:303)
	at java.util.concurrent.FutureTask.run(FutureTask.java:138)
(8 more lines...)
Collapse Failed WritableDatasetTestRun writeIntoItselfTest History
Unit Test Job < 1 sec
java.util.concurrent.ExecutionException: co.cask.cdap.explore.service.ExploreException: Cannot execute query. Reason: Response code: 500, message:'Internal Server Error', body: ''
	at co.cask.cdap.explore.client.ExploreHttpClient.execute(ExploreHttpClient.java:132)
	at co.cask.cdap.explore.client.AbstractExploreClient.execute(AbstractExploreClient.java:56)
	at co.cask.cdap.explore.client.AbstractExploreClient$5.getHandle(AbstractExploreClient.java:133)
	at co.cask.cdap.explore.client.AbstractExploreClient$14.call(AbstractExploreClient.java:234)
	at co.cask.cdap.explore.client.AbstractExploreClient$14.call(AbstractExploreClient.java:231)
	at java.util.concurrent.FutureTask$Sync.innerRun(FutureTask.java:303)
	at java.util.concurrent.FutureTask.run(FutureTask.java:138)
(8 more lines...)
Collapse Failed WritableDatasetTestRun writeIntoNonScannableDataset History
Unit Test Job 2 secs
java.util.concurrent.ExecutionException: co.cask.cdap.explore.service.ExploreException: Cannot execute query. Reason: Response code: 500, message:'Internal Server Error', body: ''
	at co.cask.cdap.explore.client.ExploreHttpClient.execute(ExploreHttpClient.java:132)
	at co.cask.cdap.explore.client.AbstractExploreClient.execute(AbstractExploreClient.java:56)
	at co.cask.cdap.explore.client.AbstractExploreClient$5.getHandle(AbstractExploreClient.java:133)
	at co.cask.cdap.explore.client.AbstractExploreClient$14.call(AbstractExploreClient.java:234)
	at co.cask.cdap.explore.client.AbstractExploreClient$14.call(AbstractExploreClient.java:231)
	at java.util.concurrent.FutureTask$Sync.innerRun(FutureTask.java:303)
	at java.util.concurrent.FutureTask.run(FutureTask.java:138)
(8 more lines...)
Collapse Failed WritableDatasetTestRun writeFromNativeTableIntoDatasetTest History
Unit Test Job < 1 sec
java.util.concurrent.ExecutionException: co.cask.cdap.explore.service.ExploreException: Cannot execute query. Reason: Response code: 500, message:'Internal Server Error', body: ''
	at co.cask.cdap.explore.client.ExploreHttpClient.execute(ExploreHttpClient.java:132)
	at co.cask.cdap.explore.client.AbstractExploreClient.execute(AbstractExploreClient.java:56)
	at co.cask.cdap.explore.client.AbstractExploreClient$5.getHandle(AbstractExploreClient.java:133)
	at co.cask.cdap.explore.client.AbstractExploreClient$14.call(AbstractExploreClient.java:234)
	at co.cask.cdap.explore.client.AbstractExploreClient$14.call(AbstractExploreClient.java:231)
	at java.util.concurrent.FutureTask$Sync.innerRun(FutureTask.java:303)
	at java.util.concurrent.FutureTask.run(FutureTask.java:138)
(8 more lines...)
Collapse Failed WritableDatasetTestRun writeIntoOtherDatasetTest History
Unit Test Job 2 secs
java.util.concurrent.ExecutionException: co.cask.cdap.explore.service.ExploreException: Cannot execute query. Reason: Response code: 500, message:'Internal Server Error', body: ''
	at co.cask.cdap.explore.client.ExploreHttpClient.execute(ExploreHttpClient.java:132)
	at co.cask.cdap.explore.client.AbstractExploreClient.execute(AbstractExploreClient.java:56)
	at co.cask.cdap.explore.client.AbstractExploreClient$5.getHandle(AbstractExploreClient.java:133)
	at co.cask.cdap.explore.client.AbstractExploreClient$14.call(AbstractExploreClient.java:234)
	at co.cask.cdap.explore.client.AbstractExploreClient$14.call(AbstractExploreClient.java:231)
	at java.util.concurrent.FutureTask$Sync.innerRun(FutureTask.java:303)
	at java.util.concurrent.FutureTask.run(FutureTask.java:138)
(8 more lines...)
Collapse Failed WritableDatasetTestRun writeFromDatasetIntoNativeTableTest History
Unit Test Job < 1 sec
co.cask.cdap.data2.dataset2.ModuleConflictException: Failed to add module kvTable due to conflict, details: Response code: 409, message:'Conflict', body: 'Cannot add module kvTable: module with same name already exists: DatasetModuleMeta{name=kvTable, className=co.cask.cdap.explore.service.datasets.KeyValueTableDefinition$KeyValueTableModule, jarLocation=file:/var/bamboo/xml-data/build-dir/CDAP-DUT-JOB1/cdap-explore/data/datasets/archive/account_placeholder/kvTable.jar, usesModules=orderedTable-memory,core, usedByModules=}'
	at co.cask.cdap.data2.datafabric.dataset.DatasetServiceClient.addModule(DatasetServiceClient.java:184)
	at co.cask.cdap.data2.datafabric.dataset.RemoteDatasetFramework.addModule(RemoteDatasetFramework.java:190)
	at co.cask.cdap.data2.datafabric.dataset.RemoteDatasetFramework.addModule(RemoteDatasetFramework.java:98)
	at co.cask.cdap.explore.service.WritableDatasetTestRun.writeFromDatasetIntoNativeTableTest(WritableDatasetTestRun.java:312)
Collapse Failed WritableDatasetTestRun multipleInsertsTest History
Unit Test Job 3 secs
java.util.concurrent.ExecutionException: co.cask.cdap.explore.service.ExploreException: Cannot execute query. Reason: Response code: 500, message:'Internal Server Error', body: ''
	at co.cask.cdap.explore.client.ExploreHttpClient.execute(ExploreHttpClient.java:132)
	at co.cask.cdap.explore.client.AbstractExploreClient.execute(AbstractExploreClient.java:56)
	at co.cask.cdap.explore.client.AbstractExploreClient$5.getHandle(AbstractExploreClient.java:133)
	at co.cask.cdap.explore.client.AbstractExploreClient$14.call(AbstractExploreClient.java:234)
	at co.cask.cdap.explore.client.AbstractExploreClient$14.call(AbstractExploreClient.java:231)
	at java.util.concurrent.FutureTask$Sync.innerRun(FutureTask.java:303)
	at java.util.concurrent.FutureTask.run(FutureTask.java:138)
(8 more lines...)

JIRA issues

IssueDescriptionStatus
Unknown Issue TypeCDAP-708Could not obtain issue details from JIRA