Build #2,014

Cask Data Application Platform - Develop Build and Test

Build: #2014 failed Child of CDAP-DRC-3565

Build result summary

Details

Completed
Duration
88 minutes
Labels
None
Revision
c3f18c44f3babecbe8650514aedc877fe30efa21 c3f18c44f3babecbe8650514aedc877fe30efa21
Total tests
2037
Fixed in
#2016 (Child of CDAP-DRC-3568)

Responsible

Code commits

Author Commit Message Commit date
Ajai Narayan Ajai Narayan c3f18c44f3babecbe8650514aedc877fe30efa21 c3f18c44f3babecbe8650514aedc877fe30efa21 Merge pull request #9741 from caskdata/feature/ui-mmds2-create-exp-view
[MMDS][CDAP-12776] - Adds Experiment Create View
Ajai Narayan Ajai Narayan 17c2d105de726785a239789144df7d344788a844 17c2d105de726785a239789144df7d344788a844 [MMDS][CDAP-12776] - Adds Experiment Create View
  - Adds create experiment store
  - Adds a CreateView - a sequence of 3 steps to start with
  - Adds Popovers for adding experiment details (name, description) and model details (same)
  - Adds ExperimentsPlusButton for list view
  - Fixes TopPanel in Dataprep + Fixes DataprepConnections to not modify title in singleWorkspaceMode
  - Fixes propTypes being static for react
  - Modifies UncontrolledPopover to have custom element as target for popover instead of font-awesome icons alone
  - Adds experiment create view to home page as a valid route
  - Adds create experiment and model apis to experiment.js
  - Adds colors from style guide to variables.scss to be reused throughtout UI
  - Fixes title of Home Page, Experiments List and Create views
Shankar <gowrishankar1988@gmail.com> Shankar <gowrishankar1988@gmail.com> 334abf9aad37dda99b30017e37d2b4a029868110 334abf9aad37dda99b30017e37d2b4a029868110 Merge pull request #9761 from caskdata/fix/netty-import
fix HttpRequest import netty in StackHandler
Shankar Selvam Shankar Selvam 4b90bfb464de461cc5038d5d4ef3b7879857792c 4b90bfb464de461cc5038d5d4ef3b7879857792c fix HttpRequest import netty in StackHandler
Shankar <gowrishankar1988@gmail.com> Shankar <gowrishankar1988@gmail.com> a2796e13e6c41840cd510743c88d8e20e50fb825 a2796e13e6c41840cd510743c88d8e20e50fb825 Merge pull request #9760 from caskdata/release/4.3
Release/4.3

Tests

New test failures 5
Status Test View job Duration
Collapse Failed SparkTest testSparkWithGetDataset History
Unit Test Job 4 secs
java.lang.IllegalStateException: Expected 200 OK, got 400 Bad Request. Error: Failed to deploy app
	at co.cask.cdap.internal.AppFabricClient.verifyResponse(AppFabricClient.java:465)
	at co.cask.cdap.internal.AppFabricClient.deployApplication(AppFabricClient.java:531)
	at co.cask.cdap.test.UnitTestManager.deployApplication(UnitTestManager.java:201)
	at co.cask.cdap.test.TestBase.deployApplication(TestBase.java:641)
	at co.cask.cdap.test.base.TestFrameworkTestBase.deployWithArtifact(TestFrameworkTestBase.java:112)
	at co.cask.cdap.test.base.TestFrameworkTestBase.deployWithArtifact(TestFrameworkTestBase.java:99)
	at co.cask.cdap.test.base.TestFrameworkTestBase.deployWithArtifact(TestFrameworkTestBase.java:82)
(51 more lines...)
Collapse Failed SparkTest testStreamSQL History
Unit Test Job 7 secs
java.lang.IllegalStateException: Expected 200 OK, got 400 Bad Request. Error: Failed to deploy app
	at co.cask.cdap.internal.AppFabricClient.verifyResponse(AppFabricClient.java:465)
	at co.cask.cdap.internal.AppFabricClient.deployApplication(AppFabricClient.java:531)
	at co.cask.cdap.test.UnitTestManager.deployApplication(UnitTestManager.java:201)
	at co.cask.cdap.test.TestBase.deployApplication(TestBase.java:641)
	at co.cask.cdap.test.base.TestFrameworkTestBase.deployWithArtifact(TestFrameworkTestBase.java:112)
	at co.cask.cdap.test.base.TestFrameworkTestBase.deployWithArtifact(TestFrameworkTestBase.java:99)
	at co.cask.cdap.test.base.TestFrameworkTestBase.deployWithArtifact(TestFrameworkTestBase.java:82)
(50 more lines...)
Collapse Failed SparkTest testPySpark History
Unit Test Job 7 secs
java.lang.IllegalStateException: Expected 200 OK, got 400 Bad Request. Error: Failed to deploy app
	at co.cask.cdap.internal.AppFabricClient.verifyResponse(AppFabricClient.java:465)
	at co.cask.cdap.internal.AppFabricClient.deployApplication(AppFabricClient.java:531)
	at co.cask.cdap.test.UnitTestManager.deployApplication(UnitTestManager.java:201)
	at co.cask.cdap.test.TestBase.deployApplication(TestBase.java:641)
	at co.cask.cdap.test.base.TestFrameworkTestBase.deployWithArtifact(TestFrameworkTestBase.java:112)
	at co.cask.cdap.test.base.TestFrameworkTestBase.deployWithArtifact(TestFrameworkTestBase.java:99)
	at co.cask.cdap.test.base.TestFrameworkTestBase.deployWithArtifact(TestFrameworkTestBase.java:82)
(50 more lines...)
Collapse Failed SparkTest testClassicSpark History
Unit Test Job 7 secs
java.lang.IllegalStateException: Expected 200 OK, got 400 Bad Request. Error: Failed to deploy app
	at co.cask.cdap.internal.AppFabricClient.verifyResponse(AppFabricClient.java:465)
	at co.cask.cdap.internal.AppFabricClient.deployApplication(AppFabricClient.java:531)
	at co.cask.cdap.test.UnitTestManager.deployApplication(UnitTestManager.java:201)
	at co.cask.cdap.test.TestBase.deployApplication(TestBase.java:641)
	at co.cask.cdap.test.base.TestFrameworkTestBase.deployWithArtifact(TestFrameworkTestBase.java:112)
	at co.cask.cdap.test.base.TestFrameworkTestBase.deployWithArtifact(TestFrameworkTestBase.java:99)
	at co.cask.cdap.test.base.TestFrameworkTestBase.deployWithArtifact(TestFrameworkTestBase.java:82)
(50 more lines...)
Collapse Failed SparkTest testSparkProgramStatusSchedule History
Unit Test Job 14 secs
java.lang.IllegalStateException: Expected 200 OK, got 400 Bad Request. Error: Failed to deploy app
	at co.cask.cdap.internal.AppFabricClient.verifyResponse(AppFabricClient.java:465)
	at co.cask.cdap.internal.AppFabricClient.deployApplication(AppFabricClient.java:531)
	at co.cask.cdap.test.UnitTestManager.deployApplication(UnitTestManager.java:201)
	at co.cask.cdap.test.TestBase.deployApplication(TestBase.java:641)
	at co.cask.cdap.test.base.TestFrameworkTestBase.deployWithArtifact(TestFrameworkTestBase.java:112)
	at co.cask.cdap.test.base.TestFrameworkTestBase.deployWithArtifact(TestFrameworkTestBase.java:99)
	at co.cask.cdap.test.base.TestFrameworkTestBase.deployWithArtifact(TestFrameworkTestBase.java:82)
(50 more lines...)

JIRA issues

IssueDescriptionStatus
10 more issues…
Unknown Issue TypeCDAP-5105Could not obtain issue details from JIRA
Unknown Issue TypeCDAP-6032Could not obtain issue details from JIRA
Unknown Issue TypeCDAP-7257Could not obtain issue details from JIRA
Unknown Issue TypeCDAP-12659Could not obtain issue details from JIRA
Unknown Issue TypeCDAP-12744Could not obtain issue details from JIRA