Build #1,776

Cask Data Application Platform - Develop Build and Test

Build: #1776 failed Child of CDAP-DRC-3004

Build result summary

Details

Completed
Duration
147 minutes
Labels
None
Agent
bamboo-agent18
Revision
eccbbca94699393d9f79c9c3fe0deb65a82fdfcd eccbbca94699393d9f79c9c3fe0deb65a82fdfcd
Total tests
2093
Fixed in
#1777 (Manual run by Terence Yim)

Responsible

Code commits

Author Commit Message Commit date
Terence Yim Terence Yim eccbbca94699393d9f79c9c3fe0deb65a82fdfcd eccbbca94699393d9f79c9c3fe0deb65a82fdfcd Update the cdap-tms-tests parent pom version after merge.
Terence Yim Terence Yim 8ed77f3165d69af47741cf3dccadebed3cad00e3 8ed77f3165d69af47741cf3dccadebed3cad00e3 Merge branch 'release/4.0' into develop
vinishavyasa <CuriousVini@users.noreply.github.com> vinishavyasa <CuriousVini@users.noreply.github.com> b42fa316137c37affef8cfa3f20d0e4b966b41ec b42fa316137c37affef8cfa3f20d0e4b966b41ec Merge pull request #7473 from caskdata/feature/remove-snapshot
Remove snapshot
Ajai Narayan Ajai Narayan 34ee0df514ea7e25cc8e87d97b9c5879490784ac 34ee0df514ea7e25cc8e87d97b9c5879490784ac Merge pull request #7488 from caskdata/bugfix_release/ui-management-fix-component-overview
Fix component overview
Ajai Narayan Ajai Narayan f103626e24512c39fad312bd78cd5283c0a0c587 f103626e24512c39fad312bd78cd5283c0a0c587 Fixes ComponentOverview to handle empty CDAP service provider in both standalone and in distributed mode

Tests

New test failures 19
Status Test View job Duration
Collapse Failed HBase12CDH570QueueTest testRollback History
Unit Test Job 46 secs
java.lang.RuntimeException: org.apache.thrift.TException: Unable to discover tx service.
	at com.google.common.base.Throwables.propagate(Throwables.java:160)
	at org.apache.tephra.distributed.TransactionServiceClient.startShort(TransactionServiceClient.java:270)
	at org.apache.tephra.TransactionContext.start(TransactionContext.java:91)
	at org.apache.tephra.DefaultTransactionExecutor.executeOnce(DefaultTransactionExecutor.java:135)
	at org.apache.tephra.DefaultTransactionExecutor.executeWithRetry(DefaultTransactionExecutor.java:117)
	at org.apache.tephra.DefaultTransactionExecutor.execute(DefaultTransactionExecutor.java:74)
	at org.apache.tephra.DefaultTransactionExecutor.execute(DefaultTransactionExecutor.java:102)
(23 more lines...)
Collapse Failed HBase12CDH570QueueTest testMultiHash History
Unit Test Job 46 secs
java.lang.RuntimeException: org.apache.thrift.TException: Unable to discover tx service.
	at com.google.common.base.Throwables.propagate(Throwables.java:160)
	at org.apache.tephra.distributed.TransactionServiceClient.startShort(TransactionServiceClient.java:270)
	at org.apache.tephra.TransactionContext.start(TransactionContext.java:91)
	at org.apache.tephra.DefaultTransactionExecutor.executeOnce(DefaultTransactionExecutor.java:135)
	at org.apache.tephra.DefaultTransactionExecutor.executeWithRetry(DefaultTransactionExecutor.java:117)
	at org.apache.tephra.DefaultTransactionExecutor.execute(DefaultTransactionExecutor.java:74)
	at org.apache.tephra.DefaultTransactionExecutor.execute(DefaultTransactionExecutor.java:102)
(24 more lines...)
Collapse Failed HBase12CDH570QueueTest testConcurrentEnqueue History
Unit Test Job 46 secs
java.lang.RuntimeException: org.apache.thrift.TException: Unable to discover tx service.
	at com.google.common.base.Throwables.propagate(Throwables.java:160)
	at org.apache.tephra.distributed.TransactionServiceClient.startShort(TransactionServiceClient.java:270)
	at org.apache.tephra.TransactionContext.start(TransactionContext.java:91)
	at org.apache.tephra.DefaultTransactionExecutor.executeOnce(DefaultTransactionExecutor.java:135)
	at org.apache.tephra.DefaultTransactionExecutor.executeWithRetry(DefaultTransactionExecutor.java:117)
	at org.apache.tephra.DefaultTransactionExecutor.execute(DefaultTransactionExecutor.java:74)
	at org.apache.tephra.DefaultTransactionExecutor.execute(DefaultTransactionExecutor.java:102)
(59 more lines...)
Collapse Failed HBase12CDH570QueueTest testReconfigure History
Unit Test Job 30 secs
java.lang.Exception: test timed out after 30000 milliseconds
	at java.lang.Thread.sleep(Native Method)
	at org.apache.tephra.distributed.RetryWithBackoff.beforeRetry(RetryWithBackoff.java:65)
	at org.apache.tephra.distributed.TransactionServiceClient.execute(TransactionServiceClient.java:233)
	at org.apache.tephra.distributed.TransactionServiceClient.execute(TransactionServiceClient.java:188)
	at org.apache.tephra.distributed.TransactionServiceClient.startShort(TransactionServiceClient.java:261)
	at org.apache.tephra.TransactionContext.start(TransactionContext.java:91)
	at org.apache.tephra.DefaultTransactionExecutor.executeOnce(DefaultTransactionExecutor.java:135)
(14 more lines...)
Collapse Failed HBase12CDH570QueueTest testOneFIFOEnqueueDequeue History
Unit Test Job 46 secs
java.lang.RuntimeException: org.apache.thrift.TException: Unable to discover tx service.
	at com.google.common.base.Throwables.propagate(Throwables.java:160)
	at org.apache.tephra.distributed.TransactionServiceClient.startShort(TransactionServiceClient.java:270)
	at org.apache.tephra.TransactionContext.start(TransactionContext.java:91)
	at org.apache.tephra.DefaultTransactionExecutor.executeOnce(DefaultTransactionExecutor.java:135)
	at org.apache.tephra.DefaultTransactionExecutor.executeWithRetry(DefaultTransactionExecutor.java:117)
	at org.apache.tephra.DefaultTransactionExecutor.execute(DefaultTransactionExecutor.java:74)
	at org.apache.tephra.DefaultTransactionExecutor.execute(DefaultTransactionExecutor.java:102)
(60 more lines...)
Collapse Failed HBase12CDH570QueueTest testOneRoundRobinEnqueueDequeue History
Unit Test Job 46 secs
java.lang.RuntimeException: org.apache.thrift.TException: Unable to discover tx service.
	at com.google.common.base.Throwables.propagate(Throwables.java:160)
	at org.apache.tephra.distributed.TransactionServiceClient.startShort(TransactionServiceClient.java:270)
	at org.apache.tephra.TransactionContext.start(TransactionContext.java:91)
	at org.apache.tephra.DefaultTransactionExecutor.executeOnce(DefaultTransactionExecutor.java:135)
	at org.apache.tephra.DefaultTransactionExecutor.executeWithRetry(DefaultTransactionExecutor.java:117)
	at org.apache.tephra.DefaultTransactionExecutor.execute(DefaultTransactionExecutor.java:74)
	at org.apache.tephra.DefaultTransactionExecutor.execute(DefaultTransactionExecutor.java:102)
(60 more lines...)
Collapse Failed HBase12CDH570QueueTest testQueueAbortRetrySkip History
Unit Test Job 46 secs
java.lang.RuntimeException: org.apache.thrift.TException: Unable to discover tx service.
	at com.google.common.base.Throwables.propagate(Throwables.java:160)
	at org.apache.tephra.distributed.TransactionServiceClient.startShort(TransactionServiceClient.java:270)
	at org.apache.tephra.TransactionContext.start(TransactionContext.java:91)
	at org.apache.tephra.DefaultTransactionExecutor.executeOnce(DefaultTransactionExecutor.java:135)
	at org.apache.tephra.DefaultTransactionExecutor.executeWithRetry(DefaultTransactionExecutor.java:117)
	at org.apache.tephra.DefaultTransactionExecutor.execute(DefaultTransactionExecutor.java:74)
	at org.apache.tephra.DefaultTransactionExecutor.execute(DefaultTransactionExecutor.java:102)
(23 more lines...)
Collapse Failed HBase12CDH570QueueTest testQueueUpgrade History
Unit Test Job 30 secs
java.lang.Exception: test timed out after 30000 milliseconds
	at java.lang.Thread.sleep(Native Method)
	at org.apache.tephra.distributed.RetryWithBackoff.beforeRetry(RetryWithBackoff.java:65)
	at org.apache.tephra.distributed.TransactionServiceClient.execute(TransactionServiceClient.java:233)
	at org.apache.tephra.distributed.TransactionServiceClient.execute(TransactionServiceClient.java:188)
	at org.apache.tephra.distributed.TransactionServiceClient.startShort(TransactionServiceClient.java:261)
	at org.apache.tephra.TransactionContext.start(TransactionContext.java:91)
	at org.apache.tephra.DefaultTransactionExecutor.executeOnce(DefaultTransactionExecutor.java:135)
(13 more lines...)
Collapse Failed HBase12CDH570QueueTest testClearAllForFlow History
Unit Test Job 47 secs
java.lang.RuntimeException: org.apache.thrift.TException: Unable to discover tx service.
	at com.google.common.base.Throwables.propagate(Throwables.java:160)
	at org.apache.tephra.distributed.TransactionServiceClient.startShort(TransactionServiceClient.java:270)
	at org.apache.tephra.TransactionContext.start(TransactionContext.java:91)
	at org.apache.tephra.DefaultTransactionExecutor.executeOnce(DefaultTransactionExecutor.java:135)
	at org.apache.tephra.DefaultTransactionExecutor.executeWithRetry(DefaultTransactionExecutor.java:117)
	at org.apache.tephra.DefaultTransactionExecutor.execute(DefaultTransactionExecutor.java:74)
	at org.apache.tephra.DefaultTransactionExecutor.execute(DefaultTransactionExecutor.java:102)
(60 more lines...)
Collapse Failed HBase12CDH570QueueTest configTest History
Unit Test Job 57 secs
java.lang.RuntimeException: org.apache.thrift.TException: Unable to discover tx service.
	at com.google.common.base.Throwables.propagate(Throwables.java:160)
	at org.apache.tephra.distributed.TransactionServiceClient.startShort(TransactionServiceClient.java:270)
	at org.apache.tephra.TransactionContext.start(TransactionContext.java:91)
	at org.apache.tephra.DefaultTransactionExecutor.executeOnce(DefaultTransactionExecutor.java:135)
	at org.apache.tephra.DefaultTransactionExecutor.executeWithRetry(DefaultTransactionExecutor.java:117)
	at org.apache.tephra.DefaultTransactionExecutor.execute(DefaultTransactionExecutor.java:74)
	at org.apache.tephra.DefaultTransactionExecutor.execute(DefaultTransactionExecutor.java:102)
(58 more lines...)
Collapse Failed HBase12CDH570QueueTest testDropAllForFlow History
Unit Test Job 47 secs
java.lang.RuntimeException: org.apache.thrift.TException: Unable to discover tx service.
	at com.google.common.base.Throwables.propagate(Throwables.java:160)
	at org.apache.tephra.distributed.TransactionServiceClient.startShort(TransactionServiceClient.java:270)
	at org.apache.tephra.TransactionContext.start(TransactionContext.java:91)
	at org.apache.tephra.DefaultTransactionExecutor.executeOnce(DefaultTransactionExecutor.java:135)
	at org.apache.tephra.DefaultTransactionExecutor.executeWithRetry(DefaultTransactionExecutor.java:117)
	at org.apache.tephra.DefaultTransactionExecutor.execute(DefaultTransactionExecutor.java:74)
	at org.apache.tephra.DefaultTransactionExecutor.execute(DefaultTransactionExecutor.java:102)
(60 more lines...)
Collapse Failed HBase12CDH570QueueTest testDropAllForNamespace History
Unit Test Job 59 secs
java.lang.RuntimeException: org.apache.thrift.TException: Unable to discover tx service.
	at com.google.common.base.Throwables.propagate(Throwables.java:160)
	at org.apache.tephra.distributed.TransactionServiceClient.startShort(TransactionServiceClient.java:270)
	at org.apache.tephra.TransactionContext.start(TransactionContext.java:91)
	at org.apache.tephra.DefaultTransactionExecutor.executeOnce(DefaultTransactionExecutor.java:135)
	at org.apache.tephra.DefaultTransactionExecutor.executeWithRetry(DefaultTransactionExecutor.java:117)
	at org.apache.tephra.DefaultTransactionExecutor.execute(DefaultTransactionExecutor.java:74)
	at org.apache.tephra.DefaultTransactionExecutor.execute(DefaultTransactionExecutor.java:102)
(59 more lines...)
Collapse Failed HBase12CDH570QueueTest testMultiStageConsumer History
Unit Test Job 49 secs
java.lang.RuntimeException: org.apache.thrift.TException: Unable to discover tx service.
	at com.google.common.base.Throwables.propagate(Throwables.java:160)
	at org.apache.tephra.distributed.TransactionServiceClient.startShort(TransactionServiceClient.java:270)
	at org.apache.tephra.TransactionContext.start(TransactionContext.java:91)
	at org.apache.tephra.DefaultTransactionExecutor.executeOnce(DefaultTransactionExecutor.java:135)
	at org.apache.tephra.DefaultTransactionExecutor.executeWithRetry(DefaultTransactionExecutor.java:117)
	at org.apache.tephra.DefaultTransactionExecutor.execute(DefaultTransactionExecutor.java:74)
	at org.apache.tephra.DefaultTransactionExecutor.execute(DefaultTransactionExecutor.java:102)
(59 more lines...)
Collapse Failed HBase12CDH570QueueTest testReset History
Unit Test Job 49 secs
java.lang.RuntimeException: org.apache.thrift.TException: Unable to discover tx service.
	at com.google.common.base.Throwables.propagate(Throwables.java:160)
	at org.apache.tephra.distributed.TransactionServiceClient.startShort(TransactionServiceClient.java:270)
	at org.apache.tephra.TransactionContext.start(TransactionContext.java:91)
	at org.apache.tephra.DefaultTransactionExecutor.executeOnce(DefaultTransactionExecutor.java:135)
	at org.apache.tephra.DefaultTransactionExecutor.executeWithRetry(DefaultTransactionExecutor.java:117)
	at org.apache.tephra.DefaultTransactionExecutor.execute(DefaultTransactionExecutor.java:74)
	at org.apache.tephra.DefaultTransactionExecutor.execute(DefaultTransactionExecutor.java:102)
(59 more lines...)
Collapse Failed HBase12CDH570QueueTest testBatchHash History
Unit Test Job 46 secs
java.lang.RuntimeException: org.apache.thrift.TException: Unable to discover tx service.
	at com.google.common.base.Throwables.propagate(Throwables.java:160)
	at org.apache.tephra.distributed.TransactionServiceClient.startShort(TransactionServiceClient.java:270)
	at org.apache.tephra.TransactionContext.start(TransactionContext.java:91)
	at org.apache.tephra.DefaultTransactionExecutor.executeOnce(DefaultTransactionExecutor.java:135)
	at org.apache.tephra.DefaultTransactionExecutor.executeWithRetry(DefaultTransactionExecutor.java:117)
	at org.apache.tephra.DefaultTransactionExecutor.execute(DefaultTransactionExecutor.java:74)
	at org.apache.tephra.DefaultTransactionExecutor.execute(DefaultTransactionExecutor.java:102)
(24 more lines...)
Collapse Failed HBase12CDH570QueueTest testSingleHash History
Unit Test Job 46 secs
java.lang.RuntimeException: org.apache.thrift.TException: Unable to discover tx service.
	at com.google.common.base.Throwables.propagate(Throwables.java:160)
	at org.apache.tephra.distributed.TransactionServiceClient.startShort(TransactionServiceClient.java:270)
	at org.apache.tephra.TransactionContext.start(TransactionContext.java:91)
	at org.apache.tephra.DefaultTransactionExecutor.executeOnce(DefaultTransactionExecutor.java:135)
	at org.apache.tephra.DefaultTransactionExecutor.executeWithRetry(DefaultTransactionExecutor.java:117)
	at org.apache.tephra.DefaultTransactionExecutor.execute(DefaultTransactionExecutor.java:74)
	at org.apache.tephra.DefaultTransactionExecutor.execute(DefaultTransactionExecutor.java:102)
(24 more lines...)
Collapse Failed HBase12CDH570QueueTest testMultiFifo History
Unit Test Job 46 secs
java.lang.RuntimeException: org.apache.thrift.TException: Unable to discover tx service.
	at com.google.common.base.Throwables.propagate(Throwables.java:160)
	at org.apache.tephra.distributed.TransactionServiceClient.startShort(TransactionServiceClient.java:270)
	at org.apache.tephra.TransactionContext.start(TransactionContext.java:91)
	at org.apache.tephra.DefaultTransactionExecutor.executeOnce(DefaultTransactionExecutor.java:135)
	at org.apache.tephra.DefaultTransactionExecutor.executeWithRetry(DefaultTransactionExecutor.java:117)
	at org.apache.tephra.DefaultTransactionExecutor.execute(DefaultTransactionExecutor.java:74)
	at org.apache.tephra.DefaultTransactionExecutor.execute(DefaultTransactionExecutor.java:102)
(24 more lines...)
Collapse Failed HBase12CDH570QueueTest testSingleFifo History
Unit Test Job 46 secs
java.lang.RuntimeException: org.apache.thrift.TException: Unable to discover tx service.
	at com.google.common.base.Throwables.propagate(Throwables.java:160)
	at org.apache.tephra.distributed.TransactionServiceClient.startShort(TransactionServiceClient.java:270)
	at org.apache.tephra.TransactionContext.start(TransactionContext.java:91)
	at org.apache.tephra.DefaultTransactionExecutor.executeOnce(DefaultTransactionExecutor.java:135)
	at org.apache.tephra.DefaultTransactionExecutor.executeWithRetry(DefaultTransactionExecutor.java:117)
	at org.apache.tephra.DefaultTransactionExecutor.execute(DefaultTransactionExecutor.java:74)
	at org.apache.tephra.DefaultTransactionExecutor.execute(DefaultTransactionExecutor.java:102)
(24 more lines...)
Collapse Failed HBase12CDH570QueueTest testDropAllQueues History
Unit Test Job 48 secs
java.lang.RuntimeException: org.apache.thrift.TException: Unable to discover tx service.
	at com.google.common.base.Throwables.propagate(Throwables.java:160)
	at org.apache.tephra.distributed.TransactionServiceClient.startShort(TransactionServiceClient.java:270)
	at org.apache.tephra.TransactionContext.start(TransactionContext.java:91)
	at org.apache.tephra.DefaultTransactionExecutor.executeOnce(DefaultTransactionExecutor.java:135)
	at org.apache.tephra.DefaultTransactionExecutor.executeWithRetry(DefaultTransactionExecutor.java:117)
	at org.apache.tephra.DefaultTransactionExecutor.execute(DefaultTransactionExecutor.java:74)
	at org.apache.tephra.DefaultTransactionExecutor.execute(DefaultTransactionExecutor.java:102)
(59 more lines...)

JIRA issues

IssueDescriptionStatus
11 more issues…
Unknown Issue TypeCDAP-5869Could not obtain issue details from JIRA
Unknown Issue TypeCDAP-7213Could not obtain issue details from JIRA
Unknown Issue TypeCDAP-7531Could not obtain issue details from JIRA
Unknown Issue TypeCDAP-7783Could not obtain issue details from JIRA
Unknown Issue TypeCDAP-7823Could not obtain issue details from JIRA