Build #160

Cask Data Application Platform - Develop Build and Test

Build: #160 failed Child of CDAP-DRC-133

Build result summary

Details

Completed
Duration
76 minutes
Labels
None
Revision
3818f3a71c788a635f9c5d562aec64ced37364f1 3818f3a71c788a635f9c5d562aec64ced37364f1
Total tests
829
Fixed in
#162 (Manual run by Alvin Wang)

Responsible

Code commits

Author Commit Message Commit date
Rohit Sinha Rohit Sinha 3818f3a71c788a635f9c5d562aec64ced37364f1 3818f3a71c788a635f9c5d562aec64ced37364f1 Merge pull request #690 from caskdata/revert-689-tmp/CDAP-652-spark-job-metrics-blocks-fix
Revert "removed metrics data stub"
Rohit Sinha Rohit Sinha c5a7bf4321eda7d4d2305c8115828983a41695f6 c5a7bf4321eda7d4d2305c8115828983a41695f6 Revert "removed metrics data stub"
Rohit Sinha Rohit Sinha 63cfb2382ffa796e4f0892255e418763553e0c26 63cfb2382ffa796e4f0892255e418763553e0c26 Merge pull request #689 from caskdata/tmp/CDAP-652-spark-job-metrics-blocks-fix
removed metrics data stub
Ajai Narayan Ajai Narayan 59211b116a6883d132c283b2d8125f5c088e960e 59211b116a6883d132c283b2d8125f5c088e960e Merge pull request #686 from caskdata/feature/ui-query-dataexplore
Query sidebar link goes to dataexplore
Rohit Sinha Rohit Sinha a83d029dac59fdce79ed2e22671624aeef445ffc a83d029dac59fdce79ed2e22671624aeef445ffc removed metrics data stub

Tests

New test failures 5
Status Test View job Duration
Collapse Failed ExternalAuthenticationServerSSLTest testInvalidAuthentication History
Unit Test Job < 1 sec
org.apache.http.conn.HttpHostConnectException: Connection to https://localhost:36520 refused
	at java.net.PlainSocketImpl.socketConnect(Native Method)
	at java.net.PlainSocketImpl.doConnect(PlainSocketImpl.java:351)
	at java.net.PlainSocketImpl.connectToAddress(PlainSocketImpl.java:213)
	at java.net.PlainSocketImpl.connect(PlainSocketImpl.java:200)
	at java.net.SocksSocketImpl.connect(SocksSocketImpl.java:366)
	at java.net.Socket.connect(Socket.java:529)
	at com.sun.net.ssl.internal.ssl.SSLSocketImpl.connect(SSLSocketImpl.java:570)
(51 more lines...)
Collapse Failed ExternalAuthenticationServerSSLTest testValidAuthentication History
Unit Test Job < 1 sec
org.apache.http.conn.HttpHostConnectException: Connection to https://localhost:36520 refused
	at java.net.PlainSocketImpl.socketConnect(Native Method)
	at java.net.PlainSocketImpl.doConnect(PlainSocketImpl.java:351)
	at java.net.PlainSocketImpl.connectToAddress(PlainSocketImpl.java:213)
	at java.net.PlainSocketImpl.connect(PlainSocketImpl.java:200)
	at java.net.SocksSocketImpl.connect(SocksSocketImpl.java:366)
	at java.net.Socket.connect(Socket.java:529)
	at com.sun.net.ssl.internal.ssl.SSLSocketImpl.connect(SSLSocketImpl.java:570)
(51 more lines...)
Collapse Failed ExternalAuthenticationServerSSLTest testInvalidPath History
Unit Test Job < 1 sec
org.apache.http.conn.HttpHostConnectException: Connection to https://localhost:36520 refused
	at java.net.PlainSocketImpl.socketConnect(Native Method)
	at java.net.PlainSocketImpl.doConnect(PlainSocketImpl.java:351)
	at java.net.PlainSocketImpl.connectToAddress(PlainSocketImpl.java:213)
	at java.net.PlainSocketImpl.connect(PlainSocketImpl.java:200)
	at java.net.SocksSocketImpl.connect(SocksSocketImpl.java:366)
	at java.net.Socket.connect(Socket.java:529)
	at com.sun.net.ssl.internal.ssl.SSLSocketImpl.connect(SSLSocketImpl.java:570)
(51 more lines...)
Collapse Failed ExternalAuthenticationServerSSLTest testExtendedToken History
Unit Test Job < 1 sec
org.apache.http.conn.HttpHostConnectException: Connection to https://localhost:36520 refused
	at java.net.PlainSocketImpl.socketConnect(Native Method)
	at java.net.PlainSocketImpl.doConnect(PlainSocketImpl.java:351)
	at java.net.PlainSocketImpl.connectToAddress(PlainSocketImpl.java:213)
	at java.net.PlainSocketImpl.connect(PlainSocketImpl.java:200)
	at java.net.SocksSocketImpl.connect(SocksSocketImpl.java:366)
	at java.net.Socket.connect(Socket.java:529)
	at com.sun.net.ssl.internal.ssl.SSLSocketImpl.connect(SSLSocketImpl.java:570)
(51 more lines...)
Collapse Failed ExternalAuthenticationServerSSLTest testStatusResponse History
Unit Test Job < 1 sec
org.apache.http.conn.HttpHostConnectException: Connection to https://localhost:36520 refused
	at java.net.PlainSocketImpl.socketConnect(Native Method)
	at java.net.PlainSocketImpl.doConnect(PlainSocketImpl.java:351)
	at java.net.PlainSocketImpl.connectToAddress(PlainSocketImpl.java:213)
	at java.net.PlainSocketImpl.connect(PlainSocketImpl.java:200)
	at java.net.SocksSocketImpl.connect(SocksSocketImpl.java:366)
	at java.net.Socket.connect(Socket.java:529)
	at com.sun.net.ssl.internal.ssl.SSLSocketImpl.connect(SSLSocketImpl.java:570)
(51 more lines...)

JIRA issues

IssueDescriptionStatus
Unknown Issue TypeCDAP-608Could not obtain issue details from JIRA
Unknown Issue TypeCDAP-652Could not obtain issue details from JIRA
Unknown Issue TypeCDAP-663Could not obtain issue details from JIRA