Build #21

Deploy CDAP Maven Plugin

Build: #21 failed Changes by Sreevatsan Raman

Logs

The following logs have been generated by the jobs in this branch.
  • Expand all
  • Collapse all
Job Logs
Collapse Build Maven Artifacts Default Stage Download or View
15-Aug-2018 17:12:51         at org.apache.maven.DefaultMaven.doExecute(DefaultMaven.java:229)
15-Aug-2018 17:12:51         at org.apache.maven.DefaultMaven.execute(DefaultMaven.java:152)
15-Aug-2018 17:12:51         at org.apache.maven.cli.MavenCli.execute(MavenCli.java:555)
15-Aug-2018 17:12:51         at org.apache.maven.cli.MavenCli.doMain(MavenCli.java:214)
15-Aug-2018 17:12:51         at org.apache.maven.cli.MavenCli.main(MavenCli.java:158)
15-Aug-2018 17:12:51         at sun.reflect.NativeMethodAccessorImpl.invoke0(Native Method)
15-Aug-2018 17:12:51         at sun.reflect.NativeMethodAccessorImpl.invoke(NativeMethodAccessorImpl.java:57)
15-Aug-2018 17:12:51         at sun.reflect.DelegatingMethodAccessorImpl.invoke(DelegatingMethodAccessorImpl.java:43)
15-Aug-2018 17:12:51         at java.lang.reflect.Method.invoke(Method.java:606)
15-Aug-2018 17:12:51         at org.codehaus.plexus.classworlds.launcher.Launcher.launchEnhanced(Launcher.java:289)
15-Aug-2018 17:12:51         at org.codehaus.plexus.classworlds.launcher.Launcher.launch(Launcher.java:229)
15-Aug-2018 17:12:51         at org.codehaus.plexus.classworlds.launcher.Launcher.mainWithExitCode(Launcher.java:415)
15-Aug-2018 17:12:51         at org.codehaus.plexus.classworlds.launcher.Launcher.main(Launcher.java:356)
15-Aug-2018 17:12:51 Caused by: org.codehaus.plexus.util.xml.pull.XmlPullParserException: Duplicated tag: 'distributionManagement' (position: START_TAG seen ...</build>\n  <distributionManagement>... @464:27)
15-Aug-2018 17:12:51         at org.apache.maven.model.io.xpp3.MavenXpp3ReaderEx.checkFieldWithDuplicate(MavenXpp3ReaderEx.java:116)
15-Aug-2018 17:12:51         at org.apache.maven.model.io.xpp3.MavenXpp3ReaderEx.parseModel(MavenXpp3ReaderEx.java:2440)
15-Aug-2018 17:12:51         at org.apache.maven.model.io.xpp3.MavenXpp3ReaderEx.read(MavenXpp3ReaderEx.java:4350)
15-Aug-2018 17:12:51         at org.apache.maven.model.io.xpp3.MavenXpp3ReaderEx.read(MavenXpp3ReaderEx.java:560)
15-Aug-2018 17:12:51         at org.apache.maven.model.io.DefaultModelReader.read(DefaultModelReader.java:118)
15-Aug-2018 17:12:51         ... 22 more
15-Aug-2018 17:12:51 [ERROR]
15-Aug-2018 17:12:51 [ERROR]
15-Aug-2018 17:12:51 [ERROR] For more information about the errors and possible solutions, please read the following articles:
15-Aug-2018 17:12:51 [ERROR] [Help 1] http://cwiki.apache.org/confluence/display/MAVEN/ProjectBuildingException
15-Aug-2018 17:12:51 [ERROR] [Help 2] http://cwiki.apache.org/confluence/display/MAVEN/ModelParseException