Integration Tests - Standalone

Integration Tests - Standalone
None

Plan summary

Current activity

No builds are currently running.

Recent history

Status Reason Completed Test results Flags
#1349 Child of CDAP-BUT-1000 6 days ago 27 passed
#1348 Changes by 5 people 6 days ago 27 passed
#1347 Child of CDAP-BUT-999 1 week ago 27 passed
#1346 Child of CDAP-BUT-994 1 week ago 27 passed
#1345 Changes by Matt Wuenschel and mattwuenschel <matt@cask.co> 1 week ago 27 passed
#1344 Child of CDAP-BUT-988 1 week ago 27 passed
#1343 Changes by Ali Anwar 1 week ago 27 passed
#1342 Child of CDAP-BUT-987 2 weeks ago 2 of 27 failed
#1341 Child of CDAP-BUT-982 2 weeks ago 27 passed
#1340 Child of CDAP-BUT-981 2 weeks ago 27 passed

Error log

    Unable to detect changes

    (31 May 2017, 12:45:09 PM)

    Repository error while detecting branches for plan CDAP-CIT. com.atlassian.bamboo.plugins.git.GitCommandException: command /usr/local/bin/git ls-remote ssh://ec0d7975-24b6-42b9-bca4-b4dad44009b5@127.0.0.1:46093/caskdata/cdap-integration-tests.git failed with code 128. Working directory was [/var/bamboo/xml-data/build-dir]., stderr:
    Error while opening SSH session
    stdout:
    Warning: Permanently added '[127.0.0.1]:46093' (RSA) to the list of known hosts.
    BAMBOO-SSH-PROXY: [SSH proxy tried to connect to [git@github.com/192.30.253.112:22]: and failed due to the following error: [Error while opening SSH session]: org.apache.sshd.common.RuntimeSshException: Failed to get the session.]
    fatal: Could not read from remote repository.
    Please make sure you have the correct access rights
    and the repository exists.

    (31 May 2017, 1:18:28 PM)

    Unable to detect changes

    (31 May 2017, 1:29:07 PM)

    Unable to detect changes

    (06 Jun 2017, 11:30:59 PM)

    Repository error while detecting branches for plan CDAP-CIT. com.atlassian.bamboo.plugins.git.GitCommandException: command /usr/local/bin/git ls-remote ssh://acbbf497-dd16-45c9-a4d6-7e119b16a24c@127.0.0.1:46093/caskdata/cdap-integration-tests.git failed with code 128. Working directory was [/var/bamboo/xml-data/build-dir]., stderr:
    Warning: Permanently added '[127.0.0.1]:46093' (RSA) to the list of known hosts.
    fatal: remote error:
      GitHub is offline for maintenance. See http://status.github.com for more info.

    (06 Jun 2017, 11:32:02 PM)

    Unable to detect changes

    (06 Jun 2017, 11:33:59 PM)

    Unable to detect changes

    (06 Jun 2017, 11:36:59 PM)

    Repository error while detecting branches for plan CDAP-CIT. com.atlassian.bamboo.plugins.git.GitCommandException: command /usr/local/bin/git ls-remote ssh://d9f253b7-5164-440a-9cb3-b9e97614f80e@127.0.0.1:46093/caskdata/cdap-integration-tests.git failed with code 128. Working directory was [/var/bamboo/xml-data/build-dir]., stderr:
    Warning: Permanently added '[127.0.0.1]:46093' (RSA) to the list of known hosts.
    fatal: remote error:
      GitHub is offline for maintenance. See http://status.github.com for more info.

    (06 Jun 2017, 11:37:02 PM)

Plan statistics

  • 25 builds
  • 92% successful
  • 23m average duration

Branches

Plan Build
release-4.3 Last build was successful #24
feature-DataStreamsTest-race Plan Disabled #1
fix-fix-XMLReaderTest Plan Disabled #1
fix-batch-joiner-itn Plan Disabled #1
fix-remove-stopall Plan Disabled #1
fix-spark-itn-errors Plan Disabled #3
release-3.2 Plan Disabled #5
fix-stream-handler-test Plan Disabled #2
fix-add-new-relation Plan Disabled #2
fix-add-new-relation 1 Plan Disabled Never built

'CDAP - Integration Tests - Standalone' all builds RSS feed Feed for all builds or just the failed builds.