Build #289

Builds CDAP artifacts and performs unit tests

Build: #289 failed Scheduled

Build result summary

Details

Completed
Duration
158 minutes
Labels
None
Revision
d4457481b53b61e341b2b4980551de26ba8b3566 d4457481b53b61e341b2b4980551de26ba8b3566
Total tests
3719
Failing since
#287 (Scheduled – )

Responsible

This build has been failing since #287
No one has taken responsibility

Tests

New test failures 3
Status Test View job Duration
Collapse Failed AutoJoinerTest testNullNotEqual History
Unit Tests 5 mins
java.util.concurrent.TimeoutException: Timeout occurred. Expected true but found false.
	at io.cdap.cdap.common.utils.Tasks.waitFor(Tasks.java:70)
	at io.cdap.cdap.common.utils.Tasks.waitFor(Tasks.java:91)
	at io.cdap.cdap.common.utils.Tasks.waitFor(Tasks.java:130)
	at io.cdap.cdap.test.AbstractProgramManager.waitForRuns(AbstractProgramManager.java:96)
	at io.cdap.cdap.test.AbstractProgramManager.startAndWaitForRun(AbstractProgramManager.java:73)
	at io.cdap.cdap.test.AbstractProgramManager.startAndWaitForRun(AbstractProgramManager.java:65)
	at io.cdap.cdap.datapipeline.AutoJoinerTest.testNullEquality(AutoJoinerTest.java:711)
(43 more lines...)
Collapse Failed ReducibleAggregatorTest io.cdap.cdap.datapipeline.ReducibleAggregatorTest History
Unit Tests < 1 sec
io.cdap.cdap.common.NamespaceCannotBeDeletedException: 'namespace:default' could not be deleted. Reason: Some programs are currently running in namespace 'namespace:default', please stop them before deleting namespace
	at io.cdap.cdap.internal.app.namespace.DefaultNamespaceAdmin.delete(DefaultNamespaceAdmin.java:263)
	at io.cdap.cdap.test.TestBase.finish(TestBase.java:512)
	at sun.reflect.NativeMethodAccessorImpl.invoke0(Native Method)
	at sun.reflect.NativeMethodAccessorImpl.invoke(NativeMethodAccessorImpl.java:62)
	at sun.reflect.DelegatingMethodAccessorImpl.invoke(DelegatingMethodAccessorImpl.java:43)
	at java.lang.reflect.Method.invoke(Method.java:498)
	at org.junit.runners.model.FrameworkMethod$1.runReflectiveCall(FrameworkMethod.java:47)
(25 more lines...)
Collapse Failed ReducibleAggregatorTest testFieldCountAgg History
Unit Tests 5 mins
java.util.concurrent.TimeoutException: Timeout occurred. Expected true but found false.
	at io.cdap.cdap.common.utils.Tasks.waitFor(Tasks.java:70)
	at io.cdap.cdap.common.utils.Tasks.waitFor(Tasks.java:91)
	at io.cdap.cdap.common.utils.Tasks.waitFor(Tasks.java:130)
	at io.cdap.cdap.test.AbstractProgramManager.waitForRuns(AbstractProgramManager.java:96)
	at io.cdap.cdap.test.AbstractProgramManager.waitForRun(AbstractProgramManager.java:90)
	at io.cdap.cdap.datapipeline.ReducibleAggregatorTest.testFieldCountAgg(ReducibleAggregatorTest.java:197)
	at io.cdap.cdap.datapipeline.ReducibleAggregatorTest.testFieldCountAgg(ReducibleAggregatorTest.java:145)
(42 more lines...)
Existing test failures 2
Status Test Failing since View job Duration
io.cdap.cdap.common.NamespaceCannotBeDeletedException: 'namespace:default' could not be deleted. Reason: Some programs are currently running in namespace 'namespace:default', please stop them before deleting namespace
	at io.cdap.cdap.internal.app.namespace.DefaultNamespaceAdmin.delete(DefaultNamespaceAdmin.java:263)
	at io.cdap.cdap.test.TestBase.finish(TestBase.java:512)
	at sun.reflect.NativeMethodAccessorImpl.invoke0(Native Method)
	at sun.reflect.NativeMethodAccessorImpl.invoke(NativeMethodAccessorImpl.java:62)
	at sun.reflect.DelegatingMethodAccessorImpl.invoke(DelegatingMethodAccessorImpl.java:43)
	at java.lang.reflect.Method.invoke(Method.java:498)
	at org.junit.runners.model.FrameworkMethod$1.runReflectiveCall(FrameworkMethod.java:47)
(25 more lines...)
java.util.concurrent.TimeoutException: Timeout occurred. Expected COMPLETED but found RUN_FAILED.
	at io.cdap.cdap.common.utils.Tasks.waitFor(Tasks.java:70)
	at io.cdap.cdap.common.utils.Tasks.waitFor(Tasks.java:91)
	at io.cdap.cdap.common.utils.Tasks.waitFor(Tasks.java:130)
	at io.cdap.cdap.datapipeline.preview.PreviewDataPipelineTest.testMultiplePhase(PreviewDataPipelineTest.java:281)
	at io.cdap.cdap.datapipeline.preview.PreviewDataPipelineTest.testMultiPhasePreview(PreviewDataPipelineTest.java:178)
	at sun.reflect.NativeMethodAccessorImpl.invoke0(Native Method)
	at sun.reflect.NativeMethodAccessorImpl.invoke(NativeMethodAccessorImpl.java:62)
(40 more lines...)
Fixed tests 5
Status Test Failing since View job Duration
Successful AutoJoinerTest testAutoRightOuterJoin History
Failing since build #288 (Scheduled) Unit Tests 19 secs
Successful AutoJoinerTest testAutoOuterJoin History
Failing since build #288 (Scheduled) Unit Tests 28 secs
Successful DataPipelineTest testErrorTransform History
Failing since build #288 (Scheduled) Unit Tests 37 secs
Successful DataPipelineTest testAlertPublisher History
Failing since build #288 (Scheduled) Unit Tests 12 secs
Successful PreviewDataPipelineTest testMultiPhasePreview History
Failing since build #288 (Scheduled) Unit Tests 34 secs