Build #1

Builds CDAP artifacts and performs unit tests

Build: #1 failed First build for this plan

Logs

The following logs have been generated by the jobs in this branch.
  • Expand all
  • Collapse all
Job Logs
Collapse Build Maven Artifacts Build Stage Download or View
09-Sep-2019 18:26:54 [INFO] CDAP Sentry Authorization Extension ............... SKIPPED
09-Sep-2019 18:26:54 [INFO] CDAP Sentry Model ................................. SKIPPED
09-Sep-2019 18:26:54 [INFO] CDAP Sentry Policy ................................ SKIPPED
09-Sep-2019 18:26:54 [INFO] CDAP Sentry Binding ............................... SKIPPED
09-Sep-2019 18:26:54 [INFO] CDAP Hue Extension ................................ SKIPPED
09-Sep-2019 18:26:54 [INFO] CDAP Security Extensions Distribution ............. SKIPPED
09-Sep-2019 18:26:54 [INFO] Cask Data Application Platform (CDAP) build ....... SKIPPED
09-Sep-2019 18:26:54 [INFO] ------------------------------------------------------------------------
09-Sep-2019 18:26:54 [INFO] BUILD FAILURE
09-Sep-2019 18:26:54 [INFO] ------------------------------------------------------------------------
09-Sep-2019 18:26:54 [INFO] Total time: 29:35.792s
09-Sep-2019 18:26:54 [INFO] Finished at: Mon Sep 09 18:26:54 UTC 2019
09-Sep-2019 18:26:55 [INFO] Final Memory: 625M/2566M
09-Sep-2019 18:26:55 [INFO] ------------------------------------------------------------------------
09-Sep-2019 18:26:55 [WARNING] The requested profile "examples" could not be activated because it does not exist.
09-Sep-2019 18:26:55 [ERROR] Failed to execute goal org.apache.maven.plugins:maven-assembly-plugin:2.2-beta-5:single (make-assembly) on project cdap-ranger-lookup: Execution make-assembly of goal org.apache.maven.plugins:maven-assembly-plugin:2.2-beta-5:single failed: Invalid signature file digest for Manifest main attributes -> [Help 1]
09-Sep-2019 18:26:55 [ERROR]
09-Sep-2019 18:26:55 [ERROR] To see the full stack trace of the errors, re-run Maven with the -e switch.
09-Sep-2019 18:26:55 [ERROR] Re-run Maven using the -X switch to enable full debug logging.
09-Sep-2019 18:26:55 [ERROR]
09-Sep-2019 18:26:55 [ERROR] For more information about the errors and possible solutions, please read the following articles:
09-Sep-2019 18:26:55 [ERROR] [Help 1] http://cwiki.apache.org/confluence/display/MAVEN/PluginExecutionException
09-Sep-2019 18:26:55 [ERROR]
09-Sep-2019 18:26:55 [ERROR] After correcting the problems, you can resume the build with the command
09-Sep-2019 18:26:55 [ERROR]   mvn <goals> -rf :cdap-ranger-lookup