Build #262

Builds CDAP artifacts and performs unit tests

Build: #262 failed Scheduled

Logs

The following logs have been generated by the jobs in this branch.
  • Expand all
  • Collapse all
Job Logs
Collapse Build Maven Artifacts Build Stage Download or View
07-May-2019 05:22:03 [INFO] CDAP Distributions ................................ SUCCESS [3.143s]
07-May-2019 05:22:03 [INFO] CDAP Application Archetypes ....................... SUCCESS [1.291s]
07-May-2019 05:22:03 [INFO] CDAP Spark Java Archetype ......................... SUCCESS [1.565s]
07-May-2019 05:22:03 [INFO] CDAP Spark Scala Archetype ........................ SUCCESS [3.408s]
07-May-2019 05:22:03 [INFO] CDAP MapReduce Archetype .......................... SUCCESS [1.356s]
07-May-2019 05:22:03 [INFO] CDAP Application Archetype ........................ SUCCESS [1.340s]
07-May-2019 05:22:03 [INFO] CDAP Integration Test Framework ................... FAILURE [22:17.350s]
07-May-2019 05:22:03 [INFO] Cask Data Application Platform (CDAP) build ....... SKIPPED
07-May-2019 05:22:03 [INFO] ------------------------------------------------------------------------
07-May-2019 05:22:03 [INFO] BUILD FAILURE
07-May-2019 05:22:03 [INFO] ------------------------------------------------------------------------
07-May-2019 05:22:03 [INFO] Total time: 1:06:13.083s
07-May-2019 05:22:03 [INFO] Finished at: Tue May 07 05:22:03 UTC 2019
07-May-2019 05:22:05 [INFO] Final Memory: 598M/2660M
07-May-2019 05:22:05 [INFO] ------------------------------------------------------------------------
07-May-2019 05:22:05 [ERROR] Failed to execute goal org.sonatype.plugins:nexus-staging-maven-plugin:1.6.2:deploy (injected-nexus-deploy) on project cdap-integration-test: Remote staging failed: Staging rules failure! -> [Help 1]
07-May-2019 05:22:05 [ERROR]
07-May-2019 05:22:05 [ERROR] To see the full stack trace of the errors, re-run Maven with the -e switch.
07-May-2019 05:22:05 [ERROR] Re-run Maven using the -X switch to enable full debug logging.
07-May-2019 05:22:05 [ERROR]
07-May-2019 05:22:05 [ERROR] For more information about the errors and possible solutions, please read the following articles:
07-May-2019 05:22:05 [ERROR] [Help 1] http://cwiki.apache.org/confluence/display/MAVEN/MojoExecutionException
07-May-2019 05:22:05 [ERROR]
07-May-2019 05:22:05 [ERROR] After correcting the problems, you can resume the build with the command
07-May-2019 05:22:05 [ERROR]   mvn <goals> -rf :cdap-integration-test