Build #319

Builds CDAP artifacts and performs unit tests

Build: #319 failed

Job: Unit Tests failed

Build log

The build generated 181 lines of output. Download or view full build log

30-Jan-2019 00:00:05 Build CDAP - Build and Unit Test - release-4.3 - Unit Tests #319 (CDAP-BUT878-RCU-319) started building on agent bamboo-agent17.prod.continuuity.net
30-Jan-2019 00:00:05 Remote Agent
30-Jan-2019 00:00:05 Build working directory is /var/bamboo/xml-data/build-dir/CDAP-BUT878-RCU
30-Jan-2019 00:00:05 Executing build CDAP - Build and Unit Test - release-4.3 - Unit Tests #319 (CDAP-BUT878-RCU-319)
30-Jan-2019 00:00:05 Starting task 'Checkout Default Repository' of type 'com.atlassian.bamboo.plugins.vcs:task.vcs.checkout'
30-Jan-2019 00:00:05 Build always requires a clean checkout
30-Jan-2019 00:00:05 Cleaning build directory '/var/bamboo/xml-data/build-dir/CDAP-BUT878-RCU'
30-Jan-2019 00:00:09 Checking out into /var/bamboo/xml-data/build-dir/CDAP-BUT878-RCU
30-Jan-2019 00:00:09 Updating source code to revision: 57aca9f450d89d63365251cbb770b174ea3f37f3
30-Jan-2019 00:00:09 Fetching 'refs/heads/*' from 'https://github.com/caskdata/cdap-build.git'.
30-Jan-2019 00:00:12 From https://github.com/caskdata/cdap-build
30-Jan-2019 00:00:12    2e86757..d74413c  develop    -> develop
30-Jan-2019 00:00:12    fb3de41..d6b3390  release/5.1 -> release/5.1
30-Jan-2019 00:00:12 Checking out revision 57aca9f450d89d63365251cbb770b174ea3f37f3.
30-Jan-2019 00:00:12 Creating local git repository in '/var/bamboo/xml-data/build-dir/CDAP-BUT878-RCU/.git'.
30-Jan-2019 00:00:12 Cloning into '/var/bamboo/xml-data/build-dir/CDAP-BUT878-RCU'...
30-Jan-2019 00:00:12 done.
30-Jan-2019 00:00:12 Switched to a new branch 'release/4.3'
30-Jan-2019 00:00:12 Branch release/4.3 set up to track remote branch release/4.3 from origin.
30-Jan-2019 00:00:12 Submodule 'apache-sentry' (git://git.apache.org/sentry.git) registered for path 'apache-sentry'
30-Jan-2019 00:00:12 Submodule 'app-artifacts/cask-tracker' (https://github.com/caskdata/cask-tracker.git) registered for path 'app-artifacts/cask-tracker'
30-Jan-2019 00:00:12 Submodule 'app-artifacts/cdap-navigator' (https://github.com/caskdata/cdap-navigator.git) registered for path 'app-artifacts/cdap-navigator'
30-Jan-2019 00:00:12 Submodule 'app-artifacts/hydrator-plugins' (https://github.com/caskdata/hydrator-plugins.git) registered for path 'app-artifacts/hydrator-plugins'
30-Jan-2019 00:00:12 Submodule 'cdap' (https://github.com/caskdata/cdap.git) registered for path 'cdap'
30-Jan-2019 00:00:12 Submodule 'security-extensions/cdap-security-extn' (https://github.com/caskdata/cdap-security-extn.git) registered for path 'security-extensions/cdap-security-extn'
30-Jan-2019 00:00:12 Cloning into 'apache-sentry'...
30-Jan-2019 00:00:13 fatal: remote error: access denied or repository not exported: /sentry.git
30-Jan-2019 00:00:13 fatal: clone of 'git://git.apache.org/sentry.git' into submodule path 'apache-sentry' failed
30-Jan-2019 00:00:13 Checkout to revision 57aca9f450d89d63365251cbb770b174ea3f37f3 has failed.
30-Jan-2019 00:00:13 Warning: failed to checkout source code to directory '/var/bamboo/xml-data/build-dir/CDAP-BUT878-RCU', trying to recover...
30-Jan-2019 00:00:13 Cleaned source directory '/var/bamboo/xml-data/build-dir/CDAP-BUT878-RCU'...
30-Jan-2019 00:00:13 Checking out revision 57aca9f450d89d63365251cbb770b174ea3f37f3.
30-Jan-2019 00:00:13 Creating local git repository in '/var/bamboo/xml-data/build-dir/CDAP-BUT878-RCU/.git'.
30-Jan-2019 00:00:13 Cloning into '/var/bamboo/xml-data/build-dir/CDAP-BUT878-RCU'...
30-Jan-2019 00:00:13 done.
30-Jan-2019 00:00:13 Switched to a new branch 'release/4.3'
30-Jan-2019 00:00:13 Branch release/4.3 set up to track remote branch release/4.3 from origin.
30-Jan-2019 00:00:13 Submodule 'apache-sentry' (git://git.apache.org/sentry.git) registered for path 'apache-sentry'
30-Jan-2019 00:00:13 Submodule 'app-artifacts/cask-tracker' (https://github.com/caskdata/cask-tracker.git) registered for path 'app-artifacts/cask-tracker'
30-Jan-2019 00:00:13 Submodule 'app-artifacts/cdap-navigator' (https://github.com/caskdata/cdap-navigator.git) registered for path 'app-artifacts/cdap-navigator'
30-Jan-2019 00:00:13 Submodule 'app-artifacts/hydrator-plugins' (https://github.com/caskdata/hydrator-plugins.git) registered for path 'app-artifacts/hydrator-plugins'
30-Jan-2019 00:00:13 Submodule 'cdap' (https://github.com/caskdata/cdap.git) registered for path 'cdap'
30-Jan-2019 00:00:13 Submodule 'security-extensions/cdap-security-extn' (https://github.com/caskdata/cdap-security-extn.git) registered for path 'security-extensions/cdap-security-extn'
30-Jan-2019 00:00:13 Cloning into 'apache-sentry'...
30-Jan-2019 00:00:13 fatal: remote error: access denied or repository not exported: /sentry.git
30-Jan-2019 00:00:13 fatal: clone of 'git://git.apache.org/sentry.git' into submodule path 'apache-sentry' failed
30-Jan-2019 00:00:13 Checkout to revision 57aca9f450d89d63365251cbb770b174ea3f37f3 has failed.
30-Jan-2019 00:00:13 Updating source code to revision: 57aca9f450d89d63365251cbb770b174ea3f37f3
30-Jan-2019 00:00:13 Fetching 'refs/heads/*' from 'https://github.com/caskdata/cdap-build.git'.
30-Jan-2019 00:00:14 Checking out revision 57aca9f450d89d63365251cbb770b174ea3f37f3.
30-Jan-2019 00:00:14 Already on 'release/4.3'
30-Jan-2019 00:00:14 Your branch is up-to-date with 'origin/release/4.3'.
30-Jan-2019 00:00:14 Cloning into 'apache-sentry'...
30-Jan-2019 00:00:14 fatal: remote error: access denied or repository not exported: /sentry.git
30-Jan-2019 00:00:14 fatal: clone of 'git://git.apache.org/sentry.git' into submodule path 'apache-sentry' failed
30-Jan-2019 00:00:14 Checkout to revision 57aca9f450d89d63365251cbb770b174ea3f37f3 has failed.
30-Jan-2019 00:00:14 Warning: failed to checkout source code to directory '/var/bamboo/xml-data/build-dir/CDAP-BUT878-RCU', trying to recover...
30-Jan-2019 00:00:14 Cleaned source directory '/var/bamboo/xml-data/build-dir/CDAP-BUT878-RCU'...
30-Jan-2019 00:00:14 Checking out revision 57aca9f450d89d63365251cbb770b174ea3f37f3.
30-Jan-2019 00:00:14 Creating local git repository in '/var/bamboo/xml-data/build-dir/CDAP-BUT878-RCU/.git'.
30-Jan-2019 00:00:15 Cloning into '/var/bamboo/xml-data/build-dir/CDAP-BUT878-RCU'...
30-Jan-2019 00:00:15 done.
30-Jan-2019 00:00:15 Branch release/4.3 set up to track remote branch release/4.3 from origin.
30-Jan-2019 00:00:15 Switched to a new branch 'release/4.3'
30-Jan-2019 00:00:15 Submodule 'apache-sentry' (git://git.apache.org/sentry.git) registered for path 'apache-sentry'
30-Jan-2019 00:00:15 Submodule 'app-artifacts/cask-tracker' (https://github.com/caskdata/cask-tracker.git) registered for path 'app-artifacts/cask-tracker'
30-Jan-2019 00:00:15 Submodule 'app-artifacts/cdap-navigator' (https://github.com/caskdata/cdap-navigator.git) registered for path 'app-artifacts/cdap-navigator'
30-Jan-2019 00:00:15 Submodule 'app-artifacts/hydrator-plugins' (https://github.com/caskdata/hydrator-plugins.git) registered for path 'app-artifacts/hydrator-plugins'
30-Jan-2019 00:00:15 Submodule 'cdap' (https://github.com/caskdata/cdap.git) registered for path 'cdap'
30-Jan-2019 00:00:15 Submodule 'security-extensions/cdap-security-extn' (https://github.com/caskdata/cdap-security-extn.git) registered for path 'security-extensions/cdap-security-extn'
30-Jan-2019 00:00:15 Cloning into 'apache-sentry'...
30-Jan-2019 00:00:15 fatal: remote error: access denied or repository not exported: /sentry.git
30-Jan-2019 00:00:15 fatal: clone of 'git://git.apache.org/sentry.git' into submodule path 'apache-sentry' failed
30-Jan-2019 00:00:15 Checkout to revision 57aca9f450d89d63365251cbb770b174ea3f37f3 has failed.
30-Jan-2019 00:00:16 Updating source code to revision: 57aca9f450d89d63365251cbb770b174ea3f37f3
30-Jan-2019 00:00:16 Fetching 'refs/heads/*' from 'https://github.com/caskdata/cdap-build.git'.
30-Jan-2019 00:00:17 Checking out revision 57aca9f450d89d63365251cbb770b174ea3f37f3.
30-Jan-2019 00:00:17 Already on 'release/4.3'
30-Jan-2019 00:00:17 Your branch is up-to-date with 'origin/release/4.3'.
30-Jan-2019 00:00:17 Cloning into 'apache-sentry'...
30-Jan-2019 00:00:17 fatal: remote error: access denied or repository not exported: /sentry.git
30-Jan-2019 00:00:17 fatal: clone of 'git://git.apache.org/sentry.git' into submodule path 'apache-sentry' failed
30-Jan-2019 00:00:17 Checkout to revision 57aca9f450d89d63365251cbb770b174ea3f37f3 has failed.
30-Jan-2019 00:00:17 Warning: failed to checkout source code to directory '/var/bamboo/xml-data/build-dir/CDAP-BUT878-RCU', trying to recover...
30-Jan-2019 00:00:17 Cleaned source directory '/var/bamboo/xml-data/build-dir/CDAP-BUT878-RCU'...
30-Jan-2019 00:00:17 Checking out revision 57aca9f450d89d63365251cbb770b174ea3f37f3.
30-Jan-2019 00:00:17 Creating local git repository in '/var/bamboo/xml-data/build-dir/CDAP-BUT878-RCU/.git'.
30-Jan-2019 00:00:17 Cloning into '/var/bamboo/xml-data/build-dir/CDAP-BUT878-RCU'...
30-Jan-2019 00:00:17 done.
30-Jan-2019 00:00:17 Switched to a new branch 'release/4.3'
30-Jan-2019 00:00:17 Branch release/4.3 set up to track remote branch release/4.3 from origin.
30-Jan-2019 00:00:17 Submodule 'apache-sentry' (git://git.apache.org/sentry.git) registered for path 'apache-sentry'
30-Jan-2019 00:00:17 Submodule 'app-artifacts/cask-tracker' (https://github.com/caskdata/cask-tracker.git) registered for path 'app-artifacts/cask-tracker'
30-Jan-2019 00:00:17 Submodule 'app-artifacts/cdap-navigator' (https://github.com/caskdata/cdap-navigator.git) registered for path 'app-artifacts/cdap-navigator'
30-Jan-2019 00:00:17 Submodule 'app-artifacts/hydrator-plugins' (https://github.com/caskdata/hydrator-plugins.git) registered for path 'app-artifacts/hydrator-plugins'
30-Jan-2019 00:00:17 Submodule 'cdap' (https://github.com/caskdata/cdap.git) registered for path 'cdap'
30-Jan-2019 00:00:17 Submodule 'security-extensions/cdap-security-extn' (https://github.com/caskdata/cdap-security-extn.git) registered for path 'security-extensions/cdap-security-extn'
30-Jan-2019 00:00:17 Cloning into 'apache-sentry'...
30-Jan-2019 00:00:17 fatal: remote error: access denied or repository not exported: /sentry.git
30-Jan-2019 00:00:17 fatal: clone of 'git://git.apache.org/sentry.git' into submodule path 'apache-sentry' failed
30-Jan-2019 00:00:17 Checkout to revision 57aca9f450d89d63365251cbb770b174ea3f37f3 has failed.
30-Jan-2019 00:00:17 Error occurred while running Task 'Checkout Default Repository(1)' of type com.atlassian.bamboo.plugins.vcs:task.vcs.checkout.
30-Jan-2019 00:00:17 java.lang.RuntimeException: com.atlassian.bamboo.repository.RepositoryException: Checkout to revision 57aca9f450d89d63365251cbb770b174ea3f37f3 has failed.command [/usr/local/bin/git submodule update --init --recursive] failed with code 128. Working directory was [/var/bamboo/xml-data/build-dir/CDAP-BUT878-RCU]., stderr:
30-Jan-2019 00:00:17 Submodule 'apache-sentry' (git://git.apache.org/sentry.git) registered for path 'apache-sentry'
30-Jan-2019 00:00:17 Submodule 'app-artifacts/cask-tracker' (https://github.com/caskdata/cask-tracker.git) registered for path 'app-artifacts/cask-tracker'
30-Jan-2019 00:00:17 Submodule 'app-artifacts/cdap-navigator' (https://github.com/caskdata/cdap-navigator.git) registered for path 'app-artifacts/cdap-navigator'
30-Jan-2019 00:00:17 Submodule 'app-artifacts/hydrator-plugins' (https://github.com/caskdata/hydrator-plugins.git) registered for path 'app-artifacts/hydrator-plugins'
30-Jan-2019 00:00:17 Submodule 'cdap' (https://github.com/caskdata/cdap.git) registered for path 'cdap'
30-Jan-2019 00:00:17 Submodule 'security-extensions/cdap-security-extn' (https://github.com/caskdata/cdap-security-extn.git) registered for path 'security-extensions/cdap-security-extn'
30-Jan-2019 00:00:17 Cloning into 'apache-sentry'...
30-Jan-2019 00:00:17 fatal: remote error: access denied or repository not exported: /sentry.git
30-Jan-2019 00:00:17 fatal: clone of 'git://git.apache.org/sentry.git' into submodule path 'apache-sentry' failed
30-Jan-2019 00:00:17         at com.atlassian.bamboo.executor.RetryingTaskExecutor.rerun(RetryingTaskExecutor.java:141)
30-Jan-2019 00:00:17         at com.atlassian.bamboo.executor.RetryingTaskExecutor.runTask(RetryingTaskExecutor.java:99)
30-Jan-2019 00:00:17         at com.atlassian.bamboo.executor.RetryingTaskExecutor.retry(RetryingTaskExecutor.java:207)
30-Jan-2019 00:00:17         at com.atlassian.bamboo.executor.RetryingTaskExecutor.retry(RetryingTaskExecutor.java:188)
30-Jan-2019 00:00:17         at com.atlassian.bamboo.plugins.vcs.task.VcsCheckoutTask.execute(VcsCheckoutTask.java:123)
30-Jan-2019 00:00:17         at com.atlassian.bamboo.task.TaskExecutorImpl.lambda$executeTasks$3(TaskExecutorImpl.java:285)
30-Jan-2019 00:00:17         at com.atlassian.bamboo.task.TaskExecutorImpl.executeTaskWithPrePostActions(TaskExecutorImpl.java:224)
30-Jan-2019 00:00:17         at com.atlassian.bamboo.task.TaskExecutorImpl.executeTasks(TaskExecutorImpl.java:285)
30-Jan-2019 00:00:17         at com.atlassian.bamboo.task.TaskExecutorImpl.executePreparationTasks(TaskExecutorImpl.java:92)
30-Jan-2019 00:00:17         at com.atlassian.bamboo.build.pipeline.tasks.PrepareBuildTask.call(PrepareBuildTask.java:81)
30-Jan-2019 00:00:17         at com.atlassian.bamboo.v2.build.agent.DefaultBuildAgent.executeBuildPhase(DefaultBuildAgent.java:203)
30-Jan-2019 00:00:17         at com.atlassian.bamboo.v2.build.agent.DefaultBuildAgent.build(DefaultBuildAgent.java:175)
30-Jan-2019 00:00:17         at com.atlassian.bamboo.v2.build.agent.BuildAgentControllerImpl.lambda$waitAndPerformBuild$0(BuildAgentControllerImpl.java:122)
30-Jan-2019 00:00:17         at com.atlassian.bamboo.variable.CustomVariableContextImpl.withVariableSubstitutor(CustomVariableContextImpl.java:185)
30-Jan-2019 00:00:17         at com.atlassian.bamboo.v2.build.agent.BuildAgentControllerImpl.waitAndPerformBuild(BuildAgentControllerImpl.java:117)
30-Jan-2019 00:00:17         at com.atlassian.bamboo.v2.build.agent.DefaultBuildAgent$1.run(DefaultBuildAgent.java:126)
30-Jan-2019 00:00:17         at com.atlassian.bamboo.utils.BambooRunnables$1.run(BambooRunnables.java:48)
30-Jan-2019 00:00:17         at com.atlassian.bamboo.security.ImpersonationHelper.runWith(ImpersonationHelper.java:26)
30-Jan-2019 00:00:17         at com.atlassian.bamboo.security.ImpersonationHelper.runWithSystemAuthority(ImpersonationHelper.java:17)
30-Jan-2019 00:00:17         at com.atlassian.bamboo.security.ImpersonationHelper$1.run(ImpersonationHelper.java:41)
30-Jan-2019 00:00:17         at java.lang.Thread.run(Thread.java:745)
30-Jan-2019 00:00:17 Caused by: com.atlassian.bamboo.repository.RepositoryException: Checkout to revision 57aca9f450d89d63365251cbb770b174ea3f37f3 has failed.command [/usr/local/bin/git submodule update --init --recursive] failed with code 128. Working directory was [/var/bamboo/xml-data/build-dir/CDAP-BUT878-RCU]., stderr:
30-Jan-2019 00:00:17 Submodule 'apache-sentry' (git://git.apache.org/sentry.git) registered for path 'apache-sentry'
30-Jan-2019 00:00:17 Submodule 'app-artifacts/cask-tracker' (https://github.com/caskdata/cask-tracker.git) registered for path 'app-artifacts/cask-tracker'
30-Jan-2019 00:00:17 Submodule 'app-artifacts/cdap-navigator' (https://github.com/caskdata/cdap-navigator.git) registered for path 'app-artifacts/cdap-navigator'
30-Jan-2019 00:00:17 Submodule 'app-artifacts/hydrator-plugins' (https://github.com/caskdata/hydrator-plugins.git) registered for path 'app-artifacts/hydrator-plugins'
30-Jan-2019 00:00:17 Submodule 'cdap' (https://github.com/caskdata/cdap.git) registered for path 'cdap'
30-Jan-2019 00:00:17 Submodule 'security-extensions/cdap-security-extn' (https://github.com/caskdata/cdap-security-extn.git) registered for path 'security-extensions/cdap-security-extn'
30-Jan-2019 00:00:17 Cloning into 'apache-sentry'...
30-Jan-2019 00:00:17 fatal: remote error: access denied or repository not exported: /sentry.git
30-Jan-2019 00:00:17 fatal: clone of 'git://git.apache.org/sentry.git' into submodule path 'apache-sentry' failed
30-Jan-2019 00:00:17         at com.atlassian.bamboo.plugins.git.NativeGitOperationHelper.checkout(NativeGitOperationHelper.java:473)
30-Jan-2019 00:00:17         at com.atlassian.bamboo.plugins.git.v2.GitWorkingCopyManager.lambda$checkout$0(GitWorkingCopyManager.java:214)
30-Jan-2019 00:00:17         at io.atlassian.util.concurrent.ManagedLocks$ManagedLockImpl.withLock(ManagedLocks.java:293)
30-Jan-2019 00:00:17         at com.atlassian.bamboo.plugins.git.v2.GitWorkingCopyManager.checkout(GitWorkingCopyManager.java:194)
30-Jan-2019 00:00:17         at com.atlassian.bamboo.plugins.git.v2.GitWorkingCopyManager.retrieveSourceCode(GitWorkingCopyManager.java:56)
30-Jan-2019 00:00:17         at com.atlassian.bamboo.plugins.vcs.task.VcsCheckoutTask.fillWorkingDirFromVcs(VcsCheckoutTask.java:206)
30-Jan-2019 00:00:17         at com.atlassian.bamboo.plugins.vcs.task.VcsCheckoutTask.access$000(VcsCheckoutTask.java:54)
30-Jan-2019 00:00:17         at com.atlassian.bamboo.plugins.vcs.task.VcsCheckoutTask$1.call(VcsCheckoutTask.java:126)
30-Jan-2019 00:00:17         at com.atlassian.bamboo.plugins.vcs.task.VcsCheckoutTask$1.call(VcsCheckoutTask.java:123)
30-Jan-2019 00:00:17         at com.atlassian.bamboo.executor.RetryingTaskExecutor.rerun(RetryingTaskExecutor.java:112)
30-Jan-2019 00:00:17         ... 20 more
30-Jan-2019 00:00:17 Caused by: com.atlassian.bamboo.plugins.git.GitCommandException: command [/usr/local/bin/git submodule update --init --recursive] failed with code 128. Working directory was [/var/bamboo/xml-data/build-dir/CDAP-BUT878-RCU]., stderr:
30-Jan-2019 00:00:17 Submodule 'apache-sentry' (git://git.apache.org/sentry.git) registered for path 'apache-sentry'
30-Jan-2019 00:00:17 Submodule 'app-artifacts/cask-tracker' (https://github.com/caskdata/cask-tracker.git) registered for path 'app-artifacts/cask-tracker'
30-Jan-2019 00:00:17 Submodule 'app-artifacts/cdap-navigator' (https://github.com/caskdata/cdap-navigator.git) registered for path 'app-artifacts/cdap-navigator'
30-Jan-2019 00:00:17 Submodule 'app-artifacts/hydrator-plugins' (https://github.com/caskdata/hydrator-plugins.git) registered for path 'app-artifacts/hydrator-plugins'
30-Jan-2019 00:00:17 Submodule 'cdap' (https://github.com/caskdata/cdap.git) registered for path 'cdap'
30-Jan-2019 00:00:17 Submodule 'security-extensions/cdap-security-extn' (https://github.com/caskdata/cdap-security-extn.git) registered for path 'security-extensions/cdap-security-extn'
30-Jan-2019 00:00:17 Cloning into 'apache-sentry'...
30-Jan-2019 00:00:17 fatal: remote error: access denied or repository not exported: /sentry.git
30-Jan-2019 00:00:17 fatal: clone of 'git://git.apache.org/sentry.git' into submodule path 'apache-sentry' failed
30-Jan-2019 00:00:17         at com.atlassian.bamboo.plugins.git.GitCommandProcessor.runCommand(GitCommandProcessor.java:703)
30-Jan-2019 00:00:17         at com.atlassian.bamboo.plugins.git.GitCommandProcessor.runCommand(GitCommandProcessor.java:632)
30-Jan-2019 00:00:17         at com.atlassian.bamboo.plugins.git.GitCommandProcessor.runCommand(GitCommandProcessor.java:623)
30-Jan-2019 00:00:17         at com.atlassian.bamboo.plugins.git.GitCommandProcessor.runSubmoduleUpdateCommand(GitCommandProcessor.java:392)
30-Jan-2019 00:00:17         at com.atlassian.bamboo.plugins.git.NativeGitOperationHelper.checkout(NativeGitOperationHelper.java:459)
30-Jan-2019 00:00:17         ... 29 more
30-Jan-2019 00:00:17 Failed to prepare the build 'CDAP - Build and Unit Test - release-4.3 - Unit Tests #319 (CDAP-BUT878-RCU-319)'
30-Jan-2019 00:00:17 Running on server: post build plugin 'NCover Results Collector'
30-Jan-2019 00:00:18 Running on server: post build plugin 'Build Hanging Detection Configuration'
30-Jan-2019 00:00:18 Running on server: post build plugin 'Clover Delta Calculator'
30-Jan-2019 00:00:18 Running on server: post build plugin 'Maven Dependencies Postprocessor'
30-Jan-2019 00:00:18 All post build plugins have finished
30-Jan-2019 00:00:18 Generating build results summary...
30-Jan-2019 00:00:19 Saving build results to disk...
30-Jan-2019 00:00:22 Logging substituted variables...
30-Jan-2019 00:00:22 Indexing build results...
30-Jan-2019 00:00:22 Finished building CDAP-BUT878-RCU-319.