Build #114

Builds CDAP artifacts and performs unit tests

Build: #114 failed Scheduled

Build result summary

Details

Completed
Duration
167 minutes
Labels
None
Revisions
CDAP Build
e4c9c94b4012e287c0f8bc6e6a804c9b9769c6ce e4c9c94b4012e287c0f8bc6e6a804c9b9769c6ce
CDAP
44816bb787726c06f0d6c9ec70ad062f2700227d 44816bb787726c06f0d6c9ec70ad062f2700227d
Total tests
2817

Responsible

No one has taken responsibility for this failure

Configuration changes

Plan configuration has changed since the last successful build. See the plan audit log for more details.

Tests

New test failures 14
Status Test View job Duration
Collapse Failed AuthorizationTest testCrossNSMapReduce History
Unit Tests < 1 sec
java.lang.AssertionError: expected:<[]> but was:<[Privilege{entity=namespace:authorization, action=WRITE}, Privilege{entity=artifact:authorization.AppWithSchedule.1.0-SNAPSHOT, action=WRITE}, Privilege{entity=dataset:authorization.input, action=ADMIN}, Privilege{entity=dataset:authorization.output, action=EXECUTE}, Privilege{entity=dataset:authorization.input, action=READ}, Privilege{entity=instance:cdap, action=ADMIN}, Privilege{entity=artifact:authorization.AppWithSchedule.1.0-SNAPSHOT, action=EXECUTE}, Privilege{entity=dataset:authorization.input, action=EXECUTE}, Privilege{entity=namespace:authorization, action=ADMIN}, Privilege{entity=namespace:authorization, action=EXECUTE}, Privilege{entity=dataset:authorization.output, action=ADMIN}, Privilege{entity=artifact:authorization.AppWithSchedule.1.0-SNAPSHOT, action=READ}, Privilege{entity=artifact:authorization.AppWithSchedule.1.0-SNAPSHOT, action=ADMIN}, Privilege{entity=dataset:authorization.output, action=WRITE}, Privilege{entity=dataset:authorization.input, action=WRITE}, Privilege{entity=namespace:authorization, action=READ}, Privilege{entity=dataset:authorization.output, action=READ}]>
	at org.junit.Assert.fail(Assert.java:88)
	at org.junit.Assert.failNotEquals(Assert.java:743)
	at org.junit.Assert.assertEquals(Assert.java:118)
	at org.junit.Assert.assertEquals(Assert.java:144)
	at co.cask.cdap.security.AuthorizationTest.setupTest(AuthorizationTest.java:177)
	at sun.reflect.NativeMethodAccessorImpl.invoke0(Native Method)
	at sun.reflect.NativeMethodAccessorImpl.invoke(NativeMethodAccessorImpl.java:57)
(48 more lines...)
Collapse Failed AuthorizationTest testCrossNSSpark History
Unit Tests < 1 sec
java.lang.AssertionError: expected:<[]> but was:<[Privilege{entity=namespace:authorization, action=WRITE}, Privilege{entity=artifact:authorization.AppWithSchedule.1.0-SNAPSHOT, action=WRITE}, Privilege{entity=dataset:authorization.input, action=ADMIN}, Privilege{entity=dataset:authorization.output, action=EXECUTE}, Privilege{entity=dataset:authorization.input, action=READ}, Privilege{entity=instance:cdap, action=ADMIN}, Privilege{entity=artifact:authorization.AppWithSchedule.1.0-SNAPSHOT, action=EXECUTE}, Privilege{entity=dataset:authorization.input, action=EXECUTE}, Privilege{entity=namespace:authorization, action=ADMIN}, Privilege{entity=namespace:authorization, action=EXECUTE}, Privilege{entity=dataset:authorization.output, action=ADMIN}, Privilege{entity=artifact:authorization.AppWithSchedule.1.0-SNAPSHOT, action=READ}, Privilege{entity=artifact:authorization.AppWithSchedule.1.0-SNAPSHOT, action=ADMIN}, Privilege{entity=dataset:authorization.output, action=WRITE}, Privilege{entity=dataset:authorization.input, action=WRITE}, Privilege{entity=namespace:authorization, action=READ}, Privilege{entity=dataset:authorization.output, action=READ}]>
	at org.junit.Assert.fail(Assert.java:88)
	at org.junit.Assert.failNotEquals(Assert.java:743)
	at org.junit.Assert.assertEquals(Assert.java:118)
	at org.junit.Assert.assertEquals(Assert.java:144)
	at co.cask.cdap.security.AuthorizationTest.setupTest(AuthorizationTest.java:177)
	at sun.reflect.NativeMethodAccessorImpl.invoke0(Native Method)
	at sun.reflect.NativeMethodAccessorImpl.invoke(NativeMethodAccessorImpl.java:57)
(48 more lines...)
Collapse Failed AuthorizationTest testFlowStreamAuth History
Unit Tests < 1 sec
java.lang.AssertionError: expected:<[]> but was:<[Privilege{entity=namespace:authorization, action=WRITE}, Privilege{entity=artifact:authorization.AppWithSchedule.1.0-SNAPSHOT, action=WRITE}, Privilege{entity=dataset:authorization.input, action=ADMIN}, Privilege{entity=dataset:authorization.output, action=EXECUTE}, Privilege{entity=dataset:authorization.input, action=READ}, Privilege{entity=instance:cdap, action=ADMIN}, Privilege{entity=artifact:authorization.AppWithSchedule.1.0-SNAPSHOT, action=EXECUTE}, Privilege{entity=dataset:authorization.input, action=EXECUTE}, Privilege{entity=namespace:authorization, action=ADMIN}, Privilege{entity=namespace:authorization, action=EXECUTE}, Privilege{entity=dataset:authorization.output, action=ADMIN}, Privilege{entity=artifact:authorization.AppWithSchedule.1.0-SNAPSHOT, action=READ}, Privilege{entity=artifact:authorization.AppWithSchedule.1.0-SNAPSHOT, action=ADMIN}, Privilege{entity=dataset:authorization.output, action=WRITE}, Privilege{entity=dataset:authorization.input, action=WRITE}, Privilege{entity=namespace:authorization, action=READ}, Privilege{entity=dataset:authorization.output, action=READ}]>
	at org.junit.Assert.fail(Assert.java:88)
	at org.junit.Assert.failNotEquals(Assert.java:743)
	at org.junit.Assert.assertEquals(Assert.java:118)
	at org.junit.Assert.assertEquals(Assert.java:144)
	at co.cask.cdap.security.AuthorizationTest.setupTest(AuthorizationTest.java:177)
	at sun.reflect.NativeMethodAccessorImpl.invoke0(Native Method)
	at sun.reflect.NativeMethodAccessorImpl.invoke(NativeMethodAccessorImpl.java:57)
(48 more lines...)
Collapse Failed AuthorizationTest testScheduleAuth History
Unit Tests 9 secs
co.cask.cdap.common.NamespaceCannotBeDeletedException: 'namespace:authorization' could not be deleted. Reason: null
	at co.cask.cdap.internal.app.namespace.DefaultNamespaceAdmin.delete(DefaultNamespaceAdmin.java:335)
	at co.cask.cdap.security.AuthorizationTest.cleanupTest(AuthorizationTest.java:1243)
	at sun.reflect.NativeMethodAccessorImpl.invoke0(Native Method)
	at sun.reflect.NativeMethodAccessorImpl.invoke(NativeMethodAccessorImpl.java:57)
	at sun.reflect.DelegatingMethodAccessorImpl.invoke(DelegatingMethodAccessorImpl.java:43)
	at java.lang.reflect.Method.invoke(Method.java:606)
	at org.junit.runners.model.FrameworkMethod$1.runReflectiveCall(FrameworkMethod.java:47)
(64 more lines...)
Collapse Failed AuthorizationTest testArtifacts History
Unit Tests < 1 sec
java.lang.AssertionError: expected:<[]> but was:<[Privilege{entity=namespace:authorization, action=WRITE}, Privilege{entity=artifact:authorization.AppWithSchedule.1.0-SNAPSHOT, action=WRITE}, Privilege{entity=dataset:authorization.input, action=ADMIN}, Privilege{entity=dataset:authorization.output, action=EXECUTE}, Privilege{entity=dataset:authorization.input, action=READ}, Privilege{entity=instance:cdap, action=ADMIN}, Privilege{entity=artifact:authorization.AppWithSchedule.1.0-SNAPSHOT, action=EXECUTE}, Privilege{entity=dataset:authorization.input, action=EXECUTE}, Privilege{entity=namespace:authorization, action=ADMIN}, Privilege{entity=namespace:authorization, action=EXECUTE}, Privilege{entity=dataset:authorization.output, action=ADMIN}, Privilege{entity=artifact:authorization.AppWithSchedule.1.0-SNAPSHOT, action=READ}, Privilege{entity=artifact:authorization.AppWithSchedule.1.0-SNAPSHOT, action=ADMIN}, Privilege{entity=dataset:authorization.output, action=WRITE}, Privilege{entity=dataset:authorization.input, action=WRITE}, Privilege{entity=namespace:authorization, action=READ}, Privilege{entity=dataset:authorization.output, action=READ}]>
	at org.junit.Assert.fail(Assert.java:88)
	at org.junit.Assert.failNotEquals(Assert.java:743)
	at org.junit.Assert.assertEquals(Assert.java:118)
	at org.junit.Assert.assertEquals(Assert.java:144)
	at co.cask.cdap.security.AuthorizationTest.setupTest(AuthorizationTest.java:177)
	at sun.reflect.NativeMethodAccessorImpl.invoke0(Native Method)
	at sun.reflect.NativeMethodAccessorImpl.invoke(NativeMethodAccessorImpl.java:57)
(48 more lines...)
Collapse Failed AuthorizationTest testCrossNSFlowlet History
Unit Tests < 1 sec
java.lang.AssertionError: expected:<[]> but was:<[Privilege{entity=namespace:authorization, action=WRITE}, Privilege{entity=artifact:authorization.AppWithSchedule.1.0-SNAPSHOT, action=WRITE}, Privilege{entity=dataset:authorization.input, action=ADMIN}, Privilege{entity=dataset:authorization.output, action=EXECUTE}, Privilege{entity=dataset:authorization.input, action=READ}, Privilege{entity=instance:cdap, action=ADMIN}, Privilege{entity=artifact:authorization.AppWithSchedule.1.0-SNAPSHOT, action=EXECUTE}, Privilege{entity=dataset:authorization.input, action=EXECUTE}, Privilege{entity=namespace:authorization, action=ADMIN}, Privilege{entity=namespace:authorization, action=EXECUTE}, Privilege{entity=dataset:authorization.output, action=ADMIN}, Privilege{entity=artifact:authorization.AppWithSchedule.1.0-SNAPSHOT, action=READ}, Privilege{entity=artifact:authorization.AppWithSchedule.1.0-SNAPSHOT, action=ADMIN}, Privilege{entity=dataset:authorization.output, action=WRITE}, Privilege{entity=dataset:authorization.input, action=WRITE}, Privilege{entity=namespace:authorization, action=READ}, Privilege{entity=dataset:authorization.output, action=READ}]>
	at org.junit.Assert.fail(Assert.java:88)
	at org.junit.Assert.failNotEquals(Assert.java:743)
	at org.junit.Assert.assertEquals(Assert.java:118)
	at org.junit.Assert.assertEquals(Assert.java:144)
	at co.cask.cdap.security.AuthorizationTest.setupTest(AuthorizationTest.java:177)
	at sun.reflect.NativeMethodAccessorImpl.invoke0(Native Method)
	at sun.reflect.NativeMethodAccessorImpl.invoke(NativeMethodAccessorImpl.java:57)
(48 more lines...)
Collapse Failed AuthorizationTest testAddDropPartitions History
Unit Tests < 1 sec
java.lang.AssertionError: expected:<[]> but was:<[Privilege{entity=namespace:authorization, action=WRITE}, Privilege{entity=artifact:authorization.AppWithSchedule.1.0-SNAPSHOT, action=WRITE}, Privilege{entity=dataset:authorization.input, action=ADMIN}, Privilege{entity=dataset:authorization.output, action=EXECUTE}, Privilege{entity=dataset:authorization.input, action=READ}, Privilege{entity=instance:cdap, action=ADMIN}, Privilege{entity=artifact:authorization.AppWithSchedule.1.0-SNAPSHOT, action=EXECUTE}, Privilege{entity=dataset:authorization.input, action=EXECUTE}, Privilege{entity=namespace:authorization, action=ADMIN}, Privilege{entity=namespace:authorization, action=EXECUTE}, Privilege{entity=dataset:authorization.output, action=ADMIN}, Privilege{entity=artifact:authorization.AppWithSchedule.1.0-SNAPSHOT, action=READ}, Privilege{entity=artifact:authorization.AppWithSchedule.1.0-SNAPSHOT, action=ADMIN}, Privilege{entity=dataset:authorization.output, action=WRITE}, Privilege{entity=dataset:authorization.input, action=WRITE}, Privilege{entity=namespace:authorization, action=READ}, Privilege{entity=dataset:authorization.output, action=READ}]>
	at org.junit.Assert.fail(Assert.java:88)
	at org.junit.Assert.failNotEquals(Assert.java:743)
	at org.junit.Assert.assertEquals(Assert.java:118)
	at org.junit.Assert.assertEquals(Assert.java:144)
	at co.cask.cdap.security.AuthorizationTest.setupTest(AuthorizationTest.java:177)
	at sun.reflect.NativeMethodAccessorImpl.invoke0(Native Method)
	at sun.reflect.NativeMethodAccessorImpl.invoke(NativeMethodAccessorImpl.java:57)
(48 more lines...)
Collapse Failed AuthorizationTest testWorkerStreamAuth History
Unit Tests < 1 sec
java.lang.AssertionError: expected:<[]> but was:<[Privilege{entity=namespace:authorization, action=WRITE}, Privilege{entity=artifact:authorization.AppWithSchedule.1.0-SNAPSHOT, action=WRITE}, Privilege{entity=dataset:authorization.input, action=ADMIN}, Privilege{entity=dataset:authorization.output, action=EXECUTE}, Privilege{entity=dataset:authorization.input, action=READ}, Privilege{entity=instance:cdap, action=ADMIN}, Privilege{entity=artifact:authorization.AppWithSchedule.1.0-SNAPSHOT, action=EXECUTE}, Privilege{entity=dataset:authorization.input, action=EXECUTE}, Privilege{entity=namespace:authorization, action=ADMIN}, Privilege{entity=namespace:authorization, action=EXECUTE}, Privilege{entity=dataset:authorization.output, action=ADMIN}, Privilege{entity=artifact:authorization.AppWithSchedule.1.0-SNAPSHOT, action=READ}, Privilege{entity=artifact:authorization.AppWithSchedule.1.0-SNAPSHOT, action=ADMIN}, Privilege{entity=dataset:authorization.output, action=WRITE}, Privilege{entity=dataset:authorization.input, action=WRITE}, Privilege{entity=namespace:authorization, action=READ}, Privilege{entity=dataset:authorization.output, action=READ}]>
	at org.junit.Assert.fail(Assert.java:88)
	at org.junit.Assert.failNotEquals(Assert.java:743)
	at org.junit.Assert.assertEquals(Assert.java:118)
	at org.junit.Assert.assertEquals(Assert.java:144)
	at co.cask.cdap.security.AuthorizationTest.setupTest(AuthorizationTest.java:177)
	at sun.reflect.NativeMethodAccessorImpl.invoke0(Native Method)
	at sun.reflect.NativeMethodAccessorImpl.invoke(NativeMethodAccessorImpl.java:57)
(48 more lines...)
Collapse Failed AuthorizationTest testNamespaces History
Unit Tests < 1 sec
java.lang.AssertionError: expected:<[]> but was:<[Privilege{entity=namespace:authorization, action=WRITE}, Privilege{entity=artifact:authorization.AppWithSchedule.1.0-SNAPSHOT, action=WRITE}, Privilege{entity=dataset:authorization.input, action=ADMIN}, Privilege{entity=dataset:authorization.output, action=EXECUTE}, Privilege{entity=dataset:authorization.input, action=READ}, Privilege{entity=instance:cdap, action=ADMIN}, Privilege{entity=artifact:authorization.AppWithSchedule.1.0-SNAPSHOT, action=EXECUTE}, Privilege{entity=dataset:authorization.input, action=EXECUTE}, Privilege{entity=namespace:authorization, action=ADMIN}, Privilege{entity=namespace:authorization, action=EXECUTE}, Privilege{entity=dataset:authorization.output, action=ADMIN}, Privilege{entity=artifact:authorization.AppWithSchedule.1.0-SNAPSHOT, action=READ}, Privilege{entity=artifact:authorization.AppWithSchedule.1.0-SNAPSHOT, action=ADMIN}, Privilege{entity=dataset:authorization.output, action=WRITE}, Privilege{entity=dataset:authorization.input, action=WRITE}, Privilege{entity=namespace:authorization, action=READ}, Privilege{entity=dataset:authorization.output, action=READ}]>
	at org.junit.Assert.fail(Assert.java:88)
	at org.junit.Assert.failNotEquals(Assert.java:743)
	at org.junit.Assert.assertEquals(Assert.java:118)
	at org.junit.Assert.assertEquals(Assert.java:144)
	at co.cask.cdap.security.AuthorizationTest.setupTest(AuthorizationTest.java:177)
	at sun.reflect.NativeMethodAccessorImpl.invoke0(Native Method)
	at sun.reflect.NativeMethodAccessorImpl.invoke(NativeMethodAccessorImpl.java:57)
(48 more lines...)
Collapse Failed AuthorizationTest testApps History
Unit Tests < 1 sec
java.lang.AssertionError: expected:<[]> but was:<[Privilege{entity=namespace:authorization, action=WRITE}, Privilege{entity=artifact:authorization.AppWithSchedule.1.0-SNAPSHOT, action=WRITE}, Privilege{entity=dataset:authorization.input, action=ADMIN}, Privilege{entity=dataset:authorization.output, action=EXECUTE}, Privilege{entity=dataset:authorization.input, action=READ}, Privilege{entity=instance:cdap, action=ADMIN}, Privilege{entity=artifact:authorization.AppWithSchedule.1.0-SNAPSHOT, action=EXECUTE}, Privilege{entity=dataset:authorization.input, action=EXECUTE}, Privilege{entity=namespace:authorization, action=ADMIN}, Privilege{entity=namespace:authorization, action=EXECUTE}, Privilege{entity=dataset:authorization.output, action=ADMIN}, Privilege{entity=artifact:authorization.AppWithSchedule.1.0-SNAPSHOT, action=READ}, Privilege{entity=artifact:authorization.AppWithSchedule.1.0-SNAPSHOT, action=ADMIN}, Privilege{entity=dataset:authorization.output, action=WRITE}, Privilege{entity=dataset:authorization.input, action=WRITE}, Privilege{entity=namespace:authorization, action=READ}, Privilege{entity=dataset:authorization.output, action=READ}]>
	at org.junit.Assert.fail(Assert.java:88)
	at org.junit.Assert.failNotEquals(Assert.java:743)
	at org.junit.Assert.assertEquals(Assert.java:118)
	at org.junit.Assert.assertEquals(Assert.java:144)
	at co.cask.cdap.security.AuthorizationTest.setupTest(AuthorizationTest.java:177)
	at sun.reflect.NativeMethodAccessorImpl.invoke0(Native Method)
	at sun.reflect.NativeMethodAccessorImpl.invoke(NativeMethodAccessorImpl.java:57)
(48 more lines...)
Collapse Failed AuthorizationTest testSparkStreamAuth History
Unit Tests < 1 sec
java.lang.AssertionError: expected:<[]> but was:<[Privilege{entity=namespace:authorization, action=WRITE}, Privilege{entity=artifact:authorization.AppWithSchedule.1.0-SNAPSHOT, action=WRITE}, Privilege{entity=dataset:authorization.input, action=ADMIN}, Privilege{entity=dataset:authorization.output, action=EXECUTE}, Privilege{entity=dataset:authorization.input, action=READ}, Privilege{entity=instance:cdap, action=ADMIN}, Privilege{entity=artifact:authorization.AppWithSchedule.1.0-SNAPSHOT, action=EXECUTE}, Privilege{entity=dataset:authorization.input, action=EXECUTE}, Privilege{entity=namespace:authorization, action=ADMIN}, Privilege{entity=namespace:authorization, action=EXECUTE}, Privilege{entity=dataset:authorization.output, action=ADMIN}, Privilege{entity=artifact:authorization.AppWithSchedule.1.0-SNAPSHOT, action=READ}, Privilege{entity=artifact:authorization.AppWithSchedule.1.0-SNAPSHOT, action=ADMIN}, Privilege{entity=dataset:authorization.output, action=WRITE}, Privilege{entity=dataset:authorization.input, action=WRITE}, Privilege{entity=namespace:authorization, action=READ}, Privilege{entity=dataset:authorization.output, action=READ}]>
	at org.junit.Assert.fail(Assert.java:88)
	at org.junit.Assert.failNotEquals(Assert.java:743)
	at org.junit.Assert.assertEquals(Assert.java:118)
	at org.junit.Assert.assertEquals(Assert.java:144)
	at co.cask.cdap.security.AuthorizationTest.setupTest(AuthorizationTest.java:177)
	at sun.reflect.NativeMethodAccessorImpl.invoke0(Native Method)
	at sun.reflect.NativeMethodAccessorImpl.invoke(NativeMethodAccessorImpl.java:57)
(48 more lines...)
Collapse Failed AuthorizationTest testStreams History
Unit Tests < 1 sec
java.lang.AssertionError: expected:<[]> but was:<[Privilege{entity=namespace:authorization, action=WRITE}, Privilege{entity=artifact:authorization.AppWithSchedule.1.0-SNAPSHOT, action=WRITE}, Privilege{entity=dataset:authorization.input, action=ADMIN}, Privilege{entity=dataset:authorization.output, action=EXECUTE}, Privilege{entity=dataset:authorization.input, action=READ}, Privilege{entity=instance:cdap, action=ADMIN}, Privilege{entity=artifact:authorization.AppWithSchedule.1.0-SNAPSHOT, action=EXECUTE}, Privilege{entity=dataset:authorization.input, action=EXECUTE}, Privilege{entity=namespace:authorization, action=ADMIN}, Privilege{entity=namespace:authorization, action=EXECUTE}, Privilege{entity=dataset:authorization.output, action=ADMIN}, Privilege{entity=artifact:authorization.AppWithSchedule.1.0-SNAPSHOT, action=READ}, Privilege{entity=artifact:authorization.AppWithSchedule.1.0-SNAPSHOT, action=ADMIN}, Privilege{entity=dataset:authorization.output, action=WRITE}, Privilege{entity=dataset:authorization.input, action=WRITE}, Privilege{entity=namespace:authorization, action=READ}, Privilege{entity=dataset:authorization.output, action=READ}]>
	at org.junit.Assert.fail(Assert.java:88)
	at org.junit.Assert.failNotEquals(Assert.java:743)
	at org.junit.Assert.assertEquals(Assert.java:118)
	at org.junit.Assert.assertEquals(Assert.java:144)
	at co.cask.cdap.security.AuthorizationTest.setupTest(AuthorizationTest.java:177)
	at sun.reflect.NativeMethodAccessorImpl.invoke0(Native Method)
	at sun.reflect.NativeMethodAccessorImpl.invoke(NativeMethodAccessorImpl.java:57)
(48 more lines...)
Collapse Failed AuthorizationTest testMRStreamAuth History
Unit Tests < 1 sec
java.lang.AssertionError: expected:<[]> but was:<[Privilege{entity=namespace:authorization, action=WRITE}, Privilege{entity=artifact:authorization.AppWithSchedule.1.0-SNAPSHOT, action=WRITE}, Privilege{entity=dataset:authorization.input, action=ADMIN}, Privilege{entity=dataset:authorization.output, action=EXECUTE}, Privilege{entity=dataset:authorization.input, action=READ}, Privilege{entity=instance:cdap, action=ADMIN}, Privilege{entity=artifact:authorization.AppWithSchedule.1.0-SNAPSHOT, action=EXECUTE}, Privilege{entity=dataset:authorization.input, action=EXECUTE}, Privilege{entity=namespace:authorization, action=ADMIN}, Privilege{entity=namespace:authorization, action=EXECUTE}, Privilege{entity=dataset:authorization.output, action=ADMIN}, Privilege{entity=artifact:authorization.AppWithSchedule.1.0-SNAPSHOT, action=READ}, Privilege{entity=artifact:authorization.AppWithSchedule.1.0-SNAPSHOT, action=ADMIN}, Privilege{entity=dataset:authorization.output, action=WRITE}, Privilege{entity=dataset:authorization.input, action=WRITE}, Privilege{entity=namespace:authorization, action=READ}, Privilege{entity=dataset:authorization.output, action=READ}]>
	at org.junit.Assert.fail(Assert.java:88)
	at org.junit.Assert.failNotEquals(Assert.java:743)
	at org.junit.Assert.assertEquals(Assert.java:118)
	at org.junit.Assert.assertEquals(Assert.java:144)
	at co.cask.cdap.security.AuthorizationTest.setupTest(AuthorizationTest.java:177)
	at sun.reflect.NativeMethodAccessorImpl.invoke0(Native Method)
	at sun.reflect.NativeMethodAccessorImpl.invoke(NativeMethodAccessorImpl.java:57)
(48 more lines...)
Collapse Failed AuthorizationTest testPrograms History
Unit Tests < 1 sec
java.lang.AssertionError: expected:<[]> but was:<[Privilege{entity=namespace:authorization, action=WRITE}, Privilege{entity=artifact:authorization.AppWithSchedule.1.0-SNAPSHOT, action=WRITE}, Privilege{entity=dataset:authorization.input, action=ADMIN}, Privilege{entity=dataset:authorization.output, action=EXECUTE}, Privilege{entity=dataset:authorization.input, action=READ}, Privilege{entity=instance:cdap, action=ADMIN}, Privilege{entity=artifact:authorization.AppWithSchedule.1.0-SNAPSHOT, action=EXECUTE}, Privilege{entity=dataset:authorization.input, action=EXECUTE}, Privilege{entity=namespace:authorization, action=ADMIN}, Privilege{entity=namespace:authorization, action=EXECUTE}, Privilege{entity=dataset:authorization.output, action=ADMIN}, Privilege{entity=artifact:authorization.AppWithSchedule.1.0-SNAPSHOT, action=READ}, Privilege{entity=artifact:authorization.AppWithSchedule.1.0-SNAPSHOT, action=ADMIN}, Privilege{entity=dataset:authorization.output, action=WRITE}, Privilege{entity=dataset:authorization.input, action=WRITE}, Privilege{entity=namespace:authorization, action=READ}, Privilege{entity=dataset:authorization.output, action=READ}]>
	at org.junit.Assert.fail(Assert.java:88)
	at org.junit.Assert.failNotEquals(Assert.java:743)
	at org.junit.Assert.assertEquals(Assert.java:118)
	at org.junit.Assert.assertEquals(Assert.java:144)
	at co.cask.cdap.security.AuthorizationTest.setupTest(AuthorizationTest.java:177)
	at sun.reflect.NativeMethodAccessorImpl.invoke0(Native Method)
	at sun.reflect.NativeMethodAccessorImpl.invoke(NativeMethodAccessorImpl.java:57)
(48 more lines...)
Fixed tests 2
Status Test Failing since View job Duration
Successful FileBatchSourceTest testRecursiveTimeFilterRegex History
Failing since build #111 (Child of CDAP-DRC7485-1) Unit Tests 6 secs
Successful FileBatchSourceTest testTimeFilterRegex History
Failing since build #111 (Child of CDAP-DRC7485-1) Unit Tests 6 secs