Build #228

Builds CDAP artifacts and performs unit tests

Build: #228 failed Scheduled with changes by Ali Anwar and Sreevatsan Raman <sree@Sreevatsans-MacBook-Pro.local>

Logs

The following logs have been generated by the jobs in this branch.
  • Expand all
  • Collapse all
Job Logs
Collapse Build Maven Artifacts Build Stage Download or View
01-Oct-2017 00:22:46 [INFO] CDAP Distributions ................................ SKIPPED
01-Oct-2017 00:22:46 [INFO] CDAP Application Archetypes ....................... SKIPPED
01-Oct-2017 00:22:46 [INFO] CDAP Spark Java Archetype ......................... SKIPPED
01-Oct-2017 00:22:46 [INFO] CDAP Spark Scala Archetype ........................ SKIPPED
01-Oct-2017 00:22:46 [INFO] CDAP MapReduce Archetype .......................... SKIPPED
01-Oct-2017 00:22:46 [INFO] CDAP Application Archetype ........................ SKIPPED
01-Oct-2017 00:22:46 [INFO] CDAP Integration Test Framework ................... SKIPPED
01-Oct-2017 00:22:46 [INFO] Cask Data Application Platform (CDAP) build ....... SKIPPED
01-Oct-2017 00:22:46 [INFO] ------------------------------------------------------------------------
01-Oct-2017 00:22:46 [INFO] BUILD FAILURE
01-Oct-2017 00:22:46 [INFO] ------------------------------------------------------------------------
01-Oct-2017 00:22:46 [INFO] Total time: 17:51.604s
01-Oct-2017 00:22:46 [INFO] Finished at: Sun Oct 01 00:22:46 UTC 2017
01-Oct-2017 00:22:47 [INFO] Final Memory: 360M/1921M
01-Oct-2017 00:22:47 [INFO] ------------------------------------------------------------------------
01-Oct-2017 00:22:47 [ERROR] Failed to execute goal com.github.eirslett:frontend-maven-plugin:0.0.23:npm (npm-install) on project cdap-ui: Failed to run task: 'npm install --color=false' failed. (error code 1) -> [Help 1]
01-Oct-2017 00:22:47 [ERROR]
01-Oct-2017 00:22:47 [ERROR] To see the full stack trace of the errors, re-run Maven with the -e switch.
01-Oct-2017 00:22:47 [ERROR] Re-run Maven using the -X switch to enable full debug logging.
01-Oct-2017 00:22:47 [ERROR]
01-Oct-2017 00:22:47 [ERROR] For more information about the errors and possible solutions, please read the following articles:
01-Oct-2017 00:22:47 [ERROR] [Help 1] http://cwiki.apache.org/confluence/display/MAVEN/MojoFailureException
01-Oct-2017 00:22:47 [ERROR]
01-Oct-2017 00:22:47 [ERROR] After correcting the problems, you can resume the build with the command
01-Oct-2017 00:22:47 [ERROR]   mvn <goals> -rf :cdap-ui