Build #1,886

Builds CDAP artifacts and performs unit tests

Build: #1886 failed Child of CDAP-DRC-4541

Build result summary

Details

Completed
Duration
47 minutes
Labels
None
Revision
757dff2bd99de4ef2d23b31437cb5c1b51bf385e 757dff2bd99de4ef2d23b31437cb5c1b51bf385e
Total tests
2016
Failing since
#1885 (Child of CDAP-DRC-4540)
Fixed in
#1887 (Child of CDAP-DRC-4542)

Responsible

This build has been failing since #1885
No one has taken responsibility

Tests

Existing test failures 8
Status Test Failing since View job Duration
java.lang.AssertionError: expected:<200> but was:<409>
	at org.junit.Assert.fail(Assert.java:88)
	at org.junit.Assert.failNotEquals(Assert.java:743)
	at org.junit.Assert.assertEquals(Assert.java:118)
	at org.junit.Assert.assertEquals(Assert.java:555)
	at org.junit.Assert.assertEquals(Assert.java:542)
	at io.cdap.cdap.internal.app.services.http.handlers.ProgramLifecycleHttpHandlerTest.testProvisionerFailureStateAndMetrics(ProgramLifecycleHttpHandlerTest.java:533)
	at sun.reflect.NativeMethodAccessorImpl.invoke0(Native Method)
(38 more lines...)
java.lang.AssertionError: expected:<200> but was:<409>
	at org.junit.Assert.fail(Assert.java:88)
	at org.junit.Assert.failNotEquals(Assert.java:743)
	at org.junit.Assert.assertEquals(Assert.java:118)
	at org.junit.Assert.assertEquals(Assert.java:555)
	at org.junit.Assert.assertEquals(Assert.java:542)
	at io.cdap.cdap.internal.app.services.http.handlers.ProgramLifecycleHttpHandlerTest.testStopProgramWhilePending(ProgramLifecycleHttpHandlerTest.java:561)
	at sun.reflect.NativeMethodAccessorImpl.invoke0(Native Method)
(38 more lines...)
java.lang.AssertionError: expected:<404> but was:<200>
	at org.junit.Assert.fail(Assert.java:88)
	at org.junit.Assert.failNotEquals(Assert.java:743)
	at org.junit.Assert.assertEquals(Assert.java:118)
	at org.junit.Assert.assertEquals(Assert.java:555)
	at org.junit.Assert.assertEquals(Assert.java:542)
	at io.cdap.cdap.internal.app.services.http.AppFabricTestBase.startProgram(AppFabricTestBase.java:835)
	at io.cdap.cdap.internal.app.services.http.AppFabricTestBase.startProgram(AppFabricTestBase.java:807)
(41 more lines...)
org.junit.ComparisonFailure: expected:<[[]]> but was:<[[{"type":"Workflow","app":"App","name":"NoOpWorkflow","description":"NoOp Workflow description"},{"type":"Workflow","app":"SleepWorkflowApp","name":"SleepWorkflow","description":"FunWorkflow description"}]]>
org.junit.ComparisonFailure: expected:<[[]]> but was:<[[{"type":"Workflow","app":"App","name":"NoOpWorkflow","description":"NoOp Workflow description"},{"type":"Workflow","app":"SleepWorkflowApp","name":"SleepWorkflow","description":"FunWorkflow description"}]]>	at org.junit.Assert.assertEquals(Assert.java:115)	at org.junit.Assert.assertEquals(Assert.java:144)	at io.cdap.cdap.internal.app.services.http.handlers.ProgramLifecycleHttpHandlerTest.testListInitialState(ProgramLifecycleHttpHandlerTest.java:1604)	at io.cdap.cdap.internal.app.services.http.handlers.ProgramLifecycleHttpHandlerTest.testProgramList(ProgramLifecycleHttpHandlerTest.java:851)	at sun.reflect.NativeMethodAccessorImpl.invoke0(Native Method)	at sun.reflect.NativeMethodAccessorImpl.invoke(NativeMethodAccessorImpl.java:62)	at sun.reflect.DelegatingMethodAccessorImpl.invoke(DelegatingMethodAccessorImpl.java:43)	at java.lang.reflect.Method.invoke(Method.java:498)	at org.junit.runners.model.FrameworkMethod$1.runReflectiveCall(FrameworkMethod.java:47)	at org.junit.internal.runners.model.ReflectiveCallable.run(ReflectiveCallable.java:12)	at org.junit.runners.model.FrameworkMethod.invokeExplosively(FrameworkMethod.java:44)	at org.junit.internal.runners.statements.InvokeMethod.evaluate(InvokeMethod.java:17)	at org.junit.internal.runners.statements.RunAfters.evaluate(RunAfters.java:27)	at org.junit.runners.ParentRunner.runLeaf(ParentRunner.java:271)	at org.junit.runners.BlockJUnit4ClassRunner.runChild(BlockJUnit4ClassRunner.java:70)	at org.junit.runners.BlockJUnit4ClassRunner.runChild(BlockJUnit4ClassRunner.java:50)	at org.junit.runners.ParentRunner$3.run(ParentRunner.java:238)	at org.junit.runners.ParentRunner$1.schedule(ParentRunner.java:63)	at org.junit.runners.ParentRunner.runChildren(ParentRunner.java:236)	at org.junit.runners.ParentRunner.access$000(ParentRunner.java:53)	at org.junit.runners.ParentRunner$2.evaluate(ParentRunner.java:229)	at org.junit.internal.runners.statements.RunBefores.evaluate(RunBefores.java:26)	at org.junit.internal.runners.statements.RunAfters.evaluate(RunAfters.java:27)	at org.junit.rules.ExternalResource$1.evaluate(ExternalResource.java:48)	at org.junit.rules.RunRules.evaluate(RunRules.java:20)	at org.junit.runners.ParentRunner.run(ParentRunner.java:309)	at org.junit.runners.Suite.runChild(Suite.java:127)	at org.junit.runners.Suite.runChild(Suite.java:26)	at org.junit.runners.ParentRunner$3.run(ParentRunner.java:238)	at org.junit.runners.ParentRunner$1.schedule(ParentRunner.java:63)	at org.junit.runners.ParentRunner.runChildren(ParentRunner.java:236)	at org.junit.runners.ParentRunner.access$000(ParentRunner.java:53)	at org.junit.runners.ParentRunner$2.evaluate(ParentRunner.java:229)	at org.junit.runners.ParentRunner.run(ParentRunner.java:309)	at org.apache.maven.surefire.junitcore.JUnitCore.run(JUnitCore.java:55)	at org.apache.maven.surefire.junitcore.JUnitCoreWrapper.createRequestAndRun(JUnitCoreWrapper.java:137)	at org.apache.maven.surefire.junitcore.JUnitCoreWrapper.executeEager(JUnitCoreWrapper.java:107)	at org.apache.maven.surefire.junitcore.JUnitCoreWrapper.execute(JUnitCoreWrapper.java:83)	at org.apache.maven.surefire.junitcore.JUnitCoreWrapper.execute(JUnitCoreWrapper.java:75)	at org.apache.maven.surefire.junitcore.JUnitCoreProvider.invoke(JUnitCoreProvider.java:161)	at org.apache.maven.surefire.booter.ForkedBooter.invokeProviderInSameClassLoader(ForkedBooter.java:290)	at org.apache.maven.surefire.booter.ForkedBooter.runSuitesInProcess(ForkedBooter.java:242)	at org.apache.maven.surefire.booter.ForkedBooter.main(ForkedBooter.java:121)
java.lang.AssertionError: expected:<200> but was:<409>
	at org.junit.Assert.fail(Assert.java:88)
	at org.junit.Assert.failNotEquals(Assert.java:743)
	at org.junit.Assert.assertEquals(Assert.java:118)
	at org.junit.Assert.assertEquals(Assert.java:555)
	at org.junit.Assert.assertEquals(Assert.java:542)
	at io.cdap.cdap.internal.app.services.http.handlers.ProgramLifecycleHttpHandlerTest.testWorkflowHistory(ProgramLifecycleHttpHandlerTest.java:496)
	at sun.reflect.NativeMethodAccessorImpl.invoke0(Native Method)
(38 more lines...)
java.lang.AssertionError: expected:<200> but was:<409>
	at org.junit.Assert.fail(Assert.java:88)
	at org.junit.Assert.failNotEquals(Assert.java:743)
	at org.junit.Assert.assertEquals(Assert.java:118)
	at org.junit.Assert.assertEquals(Assert.java:555)
	at org.junit.Assert.assertEquals(Assert.java:542)
	at io.cdap.cdap.internal.app.services.http.handlers.ProgramLifecycleHttpHandlerTest.testStopProgramRunWhilePending(ProgramLifecycleHttpHandlerTest.java:592)
	at sun.reflect.NativeMethodAccessorImpl.invoke0(Native Method)
(38 more lines...)
java.lang.AssertionError: expected:<200> but was:<409>
	at org.junit.Assert.fail(Assert.java:88)
	at org.junit.Assert.failNotEquals(Assert.java:743)
	at org.junit.Assert.assertEquals(Assert.java:118)
	at org.junit.Assert.assertEquals(Assert.java:555)
	at org.junit.Assert.assertEquals(Assert.java:542)
	at io.cdap.cdap.internal.app.services.http.handlers.ProgramLifecycleHttpHandlerTest.testProgramStartStopStatusErrors(ProgramLifecycleHttpHandlerTest.java:427)
	at sun.reflect.NativeMethodAccessorImpl.invoke0(Native Method)
(38 more lines...)
java.util.concurrent.TimeoutException: Timeout occurred. Expected 200 but found 409.
	at io.cdap.cdap.common.utils.Tasks.waitFor(Tasks.java:70)
	at io.cdap.cdap.common.utils.Tasks.waitFor(Tasks.java:91)
	at io.cdap.cdap.common.utils.Tasks.waitFor(Tasks.java:130)
	at io.cdap.cdap.internal.app.services.http.AppFabricTestBase.deleteNamespaces(AppFabricTestBase.java:958)
	at io.cdap.cdap.internal.app.services.http.AppFabricTestBase.afterClass(AppFabricTestBase.java:300)
	at sun.reflect.NativeMethodAccessorImpl.invoke0(Native Method)
	at sun.reflect.NativeMethodAccessorImpl.invoke(NativeMethodAccessorImpl.java:62)
(26 more lines...)