Build #1,576

Builds CDAP artifacts and performs unit tests

Build: #1576 failed Scheduled

Build result summary

Details

Completed
Duration
273 minutes
Labels
None
Revision
2e867578d6bc124bff20af1d39e52cbd48f39d67 2e867578d6bc124bff20af1d39e52cbd48f39d67
Total tests
3536
Failing since
#1574 (Scheduled – )
Fixed in
#1582 (Scheduled)

Responsible

This build has been failing since #1574
No one has taken responsibility

Tests

New test failures 6
Status Test View job Duration
Collapse Failed AlertPublisherTest co.cask.hydrator.plugin.batch.AlertPublisherTest History
Unit Tests < 1 sec
java.lang.IllegalArgumentException: duplicate key: plugin:avro:outputformat
	at com.google.common.base.Preconditions.checkArgument(Preconditions.java:119)
	at com.google.common.collect.RegularImmutableMap.<init>(RegularImmutableMap.java:70)
	at com.google.common.collect.ImmutableMap$Builder.fromEntryList(ImmutableMap.java:249)
	at com.google.common.collect.ImmutableMap$Builder.build(ImmutableMap.java:235)
	at co.cask.cdap.data2.metadata.system.ArtifactSystemMetadataWriter.getSystemPropertiesToAdd(ArtifactSystemMetadataWriter.java:56)
	at co.cask.cdap.data2.metadata.system.AbstractSystemMetadataWriter.write(AbstractSystemMetadataWriter.java:74)
	at co.cask.cdap.internal.app.runtime.artifact.DefaultArtifactRepository.writeSystemMetadata(DefaultArtifactRepository.java:674)
(43 more lines...)
Collapse Failed BatchPluginsTestSuite co.cask.hydrator.plugin.batch.BatchPluginsTestSuite History
Unit Tests < 1 sec
java.lang.IllegalArgumentException: duplicate key: plugin:avro:outputformat
	at com.google.common.base.Preconditions.checkArgument(Preconditions.java:119)
	at com.google.common.collect.RegularImmutableMap.<init>(RegularImmutableMap.java:70)
	at com.google.common.collect.ImmutableMap$Builder.fromEntryList(ImmutableMap.java:249)
	at com.google.common.collect.ImmutableMap$Builder.build(ImmutableMap.java:235)
	at co.cask.cdap.data2.metadata.system.ArtifactSystemMetadataWriter.getSystemPropertiesToAdd(ArtifactSystemMetadataWriter.java:56)
	at co.cask.cdap.data2.metadata.system.AbstractSystemMetadataWriter.write(AbstractSystemMetadataWriter.java:74)
	at co.cask.cdap.internal.app.runtime.artifact.DefaultArtifactRepository.writeSystemMetadata(DefaultArtifactRepository.java:674)
(43 more lines...)
Collapse Failed RowDenormalizerAggregatorTest co.cask.hydrator.plugin.batch.aggregator.RowDenormalizerAggregatorTest History
Unit Tests < 1 sec
java.lang.IllegalArgumentException: duplicate key: plugin:avro:outputformat
	at com.google.common.base.Preconditions.checkArgument(Preconditions.java:119)
	at com.google.common.collect.RegularImmutableMap.<init>(RegularImmutableMap.java:70)
	at com.google.common.collect.ImmutableMap$Builder.fromEntryList(ImmutableMap.java:249)
	at com.google.common.collect.ImmutableMap$Builder.build(ImmutableMap.java:235)
	at co.cask.cdap.data2.metadata.system.ArtifactSystemMetadataWriter.getSystemPropertiesToAdd(ArtifactSystemMetadataWriter.java:56)
	at co.cask.cdap.data2.metadata.system.AbstractSystemMetadataWriter.write(AbstractSystemMetadataWriter.java:74)
	at co.cask.cdap.internal.app.runtime.artifact.DefaultArtifactRepository.writeSystemMetadata(DefaultArtifactRepository.java:674)
(43 more lines...)
Collapse Failed BatchCubeSinkTest co.cask.hydrator.plugin.batch.sink.BatchCubeSinkTest History
Unit Tests < 1 sec
java.lang.IllegalArgumentException: duplicate key: plugin:avro:outputformat
	at com.google.common.base.Preconditions.checkArgument(Preconditions.java:119)
	at com.google.common.collect.RegularImmutableMap.<init>(RegularImmutableMap.java:70)
	at com.google.common.collect.ImmutableMap$Builder.fromEntryList(ImmutableMap.java:249)
	at com.google.common.collect.ImmutableMap$Builder.build(ImmutableMap.java:235)
	at co.cask.cdap.data2.metadata.system.ArtifactSystemMetadataWriter.getSystemPropertiesToAdd(ArtifactSystemMetadataWriter.java:56)
	at co.cask.cdap.data2.metadata.system.AbstractSystemMetadataWriter.write(AbstractSystemMetadataWriter.java:74)
	at co.cask.cdap.internal.app.runtime.artifact.DefaultArtifactRepository.writeSystemMetadata(DefaultArtifactRepository.java:674)
(43 more lines...)
Collapse Failed TableSinkTest co.cask.hydrator.plugin.batch.sink.TableSinkTest History
Unit Tests < 1 sec
java.lang.IllegalArgumentException: duplicate key: plugin:avro:outputformat
	at com.google.common.base.Preconditions.checkArgument(Preconditions.java:119)
	at com.google.common.collect.RegularImmutableMap.<init>(RegularImmutableMap.java:70)
	at com.google.common.collect.ImmutableMap$Builder.fromEntryList(ImmutableMap.java:249)
	at com.google.common.collect.ImmutableMap$Builder.build(ImmutableMap.java:235)
	at co.cask.cdap.data2.metadata.system.ArtifactSystemMetadataWriter.getSystemPropertiesToAdd(ArtifactSystemMetadataWriter.java:56)
	at co.cask.cdap.data2.metadata.system.AbstractSystemMetadataWriter.write(AbstractSystemMetadataWriter.java:74)
	at co.cask.cdap.internal.app.runtime.artifact.DefaultArtifactRepository.writeSystemMetadata(DefaultArtifactRepository.java:674)
(43 more lines...)
Collapse Failed FileBatchSourceTest co.cask.hydrator.plugin.batch.source.FileBatchSourceTest History
Unit Tests < 1 sec
java.lang.IllegalArgumentException: duplicate key: plugin:avro:outputformat
	at com.google.common.base.Preconditions.checkArgument(Preconditions.java:119)
	at com.google.common.collect.RegularImmutableMap.<init>(RegularImmutableMap.java:70)
	at com.google.common.collect.ImmutableMap$Builder.fromEntryList(ImmutableMap.java:249)
	at com.google.common.collect.ImmutableMap$Builder.build(ImmutableMap.java:235)
	at co.cask.cdap.data2.metadata.system.ArtifactSystemMetadataWriter.getSystemPropertiesToAdd(ArtifactSystemMetadataWriter.java:56)
	at co.cask.cdap.data2.metadata.system.AbstractSystemMetadataWriter.write(AbstractSystemMetadataWriter.java:74)
	at co.cask.cdap.internal.app.runtime.artifact.DefaultArtifactRepository.writeSystemMetadata(DefaultArtifactRepository.java:674)
(44 more lines...)
Fixed tests 1
Status Test Failing since View job Duration
Successful FlowTest testFlowPendingMetric History
Failing since build #1574 (Scheduled) Unit Tests 4 secs