Build #1,413

Builds CDAP artifacts and performs unit tests

Build: #1413 failed Scheduled

Build result summary

Details

Completed
Duration
231 minutes
Labels
None
Revision
2e867578d6bc124bff20af1d39e52cbd48f39d67 2e867578d6bc124bff20af1d39e52cbd48f39d67
Total tests
3491
Failing since
#1410 (Child of CDAP-DRC-3940)
Fixed in
#1415 (Manual run by Sagar Kapare)

Responsible

This build has been failing since #1410
No one has taken responsibility

Tests

New test failures 2
Status Test View job Duration
Collapse Failed PreviewDataPipelineTest testPreviewFailedRun History
Unit Tests < 1 sec
co.cask.cdap.api.dataset.InstanceConflictException: Failed to add instance singleInput due to conflict, details: Response code: 409, message: 'Conflict', body: ''dataset:default.singleInput' already exists'
	at co.cask.cdap.data2.datafabric.dataset.DatasetServiceClient.addInstance(DatasetServiceClient.java:183)
	at co.cask.cdap.data2.datafabric.dataset.RemoteDatasetFramework.addInstance(RemoteDatasetFramework.java:147)
	at co.cask.cdap.data2.dataset2.ForwardingDatasetFramework.addInstance(ForwardingDatasetFramework.java:79)
	at co.cask.cdap.data2.dataset2.DatasetFramework.addInstance(DatasetFramework.java:140)
	at co.cask.cdap.test.UnitTestManager.addDatasetInstance(UnitTestManager.java:308)
	at co.cask.cdap.test.TestBase.addDatasetInstance(TestBase.java:789)
	at co.cask.cdap.test.TestBase.addDatasetInstance(TestBase.java:804)
(50 more lines...)
Collapse Failed PreviewDataPipelineTest testDataPipelinePreviewRuns History
Unit Tests 1 min
co.cask.cdap.api.dataset.DatasetManagementException: Error making request to dataset.service service at http://localhost:44714/v3/namespaces/default/data/datasets/singleInput while doing GET with headers .
	at co.cask.cdap.data2.datafabric.dataset.DatasetServiceClient.doRequest(DatasetServiceClient.java:325)
	at co.cask.cdap.data2.datafabric.dataset.DatasetServiceClient.doGet(DatasetServiceClient.java:290)
	at co.cask.cdap.data2.datafabric.dataset.DatasetServiceClient.getInstance(DatasetServiceClient.java:109)
	at co.cask.cdap.data2.datafabric.dataset.DatasetServiceClient.getInstance(DatasetServiceClient.java:128)
	at co.cask.cdap.data2.datafabric.dataset.RemoteDatasetFramework.getAdmin(RemoteDatasetFramework.java:221)
	at co.cask.cdap.data2.datafabric.dataset.RemoteDatasetFramework.getAdmin(RemoteDatasetFramework.java:211)
	at co.cask.cdap.data2.dataset2.ForwardingDatasetFramework.getAdmin(ForwardingDatasetFramework.java:141)
(70 more lines...)
Existing test failures 1
Status Test Failing since View job Duration
java.util.concurrent.TimeoutException: Timeout occurred. Expected 0 but found 1.
	at co.cask.cdap.common.utils.Tasks.waitFor(Tasks.java:70)
	at co.cask.cdap.common.utils.Tasks.waitFor(Tasks.java:91)
	at co.cask.cdap.report.ReportGenerationAppTest.testReportExpiration(ReportGenerationAppTest.java:358)
	at sun.reflect.NativeMethodAccessorImpl.invoke0(Native Method)
	at sun.reflect.NativeMethodAccessorImpl.invoke(NativeMethodAccessorImpl.java:62)
	at sun.reflect.DelegatingMethodAccessorImpl.invoke(DelegatingMethodAccessorImpl.java:43)
	at java.lang.reflect.Method.invoke(Method.java:498)
(46 more lines...)
Fixed tests 1
Status Test Failing since View job Duration
Successful ReportGenerationAppTest testReportExpiration History
Failing since build #1412 (Child of CDAP-DRC-3945) Unit Tests 30 secs