Build #1,410

Builds CDAP artifacts and performs unit tests

Build: #1410 failed Child of CDAP-DRC-3940

Build result summary

Details

Completed
Duration
318 minutes
Labels
None
Revision
2e867578d6bc124bff20af1d39e52cbd48f39d67 2e867578d6bc124bff20af1d39e52cbd48f39d67
Total tests
3482
Fixed in
#1415 (Manual run by Sagar Kapare)

Responsible

No one has taken responsibility for this failure

Tests

New test failures 2
Status Test View job Duration
Collapse Failed UsageHandlerTestRun testServiceUsage History
Unit Tests 1 min
java.io.IOException: org.apache.tephra.TransactionNotInProgressException: canCommit() is called for transaction 1533915780326000000 that is not in progress (it is known to be invalid)
	at co.cask.cdap.client.util.RESTClient.upload(RESTClient.java:160)
	at co.cask.cdap.client.ApplicationClient.deployApp(ApplicationClient.java:449)
	at co.cask.cdap.client.ApplicationClient.deploy(ApplicationClient.java:339)
	at co.cask.cdap.client.UsageHandlerTestRun.deployApp(UsageHandlerTestRun.java:55)
	at co.cask.cdap.client.UsageHandlerTestRun.testServiceUsage(UsageHandlerTestRun.java:258)
	at sun.reflect.NativeMethodAccessorImpl.invoke0(Native Method)
	at sun.reflect.NativeMethodAccessorImpl.invoke(NativeMethodAccessorImpl.java:62)
(55 more lines...)
Collapse Failed DataStreamsSparkSinkTest testSparkSink History
Unit Tests 1 min
java.lang.RuntimeException: org.apache.tephra.TransactionNotInProgressException: canCommit() is called for transaction 1533913400710000000 that is not in progress (it is known to be invalid)
	at co.cask.cdap.api.Transactionals.propagate(Transactionals.java:195)
	at co.cask.cdap.api.Transactionals.execute(Transactionals.java:108)
	at co.cask.cdap.internal.app.store.DefaultStore.getApplication(DefaultStore.java:607)
	at co.cask.cdap.internal.app.services.ApplicationLifecycleService.updateAppAllowed(ApplicationLifecycleService.java:272)
	at co.cask.cdap.gateway.handlers.AppLifecycleHttpHandler.createAppVersion(AppLifecycleHttpHandler.java:195)
	at co.cask.cdap.internal.AppFabricClient.deployApplication(AppFabricClient.java:513)
	at co.cask.cdap.test.UnitTestManager.deployApplication(UnitTestManager.java:201)
(63 more lines...)