Build #1,276

Builds CDAP artifacts and performs unit tests

Build: #1276 failed Scheduled

Build result summary

Details

Completed
Duration
92 minutes
Labels
None
Revisions
CDAP Build
191281a07606f8e56e8756d9ff0be022e5f843a8 191281a07606f8e56e8756d9ff0be022e5f843a8
CDAP
7a6945d8d455922692306b74d58289ff8a1a1d1f 7a6945d8d455922692306b74d58289ff8a1a1d1f
Total tests
1949
Fixed in
#1277 (Scheduled)

Responsible

No one has taken responsibility for this failure

Tests

New test failures 2
Status Test View job Duration
Collapse Failed MapReduceProgramRunnerTest testJobSuccessWithFrequentFlushing History
Unit Tests 1 min
java.util.concurrent.ExecutionException: co.cask.cdap.api.dataset.DatasetManagementException: Error making request to dataset.service service at http://bamboo-agent01:43602/v3/namespaces/default/data/datasets/recorder while doing PUT with headers  and body {"typeName":"co.cask.cdap.api.dataset.lib.KeyValueTable","properties":{}}.
	at com.google.common.util.concurrent.AbstractFuture$Sync.getValue(AbstractFuture.java:294)
	at com.google.common.util.concurrent.AbstractFuture$Sync.get(AbstractFuture.java:281)
	at com.google.common.util.concurrent.AbstractFuture.get(AbstractFuture.java:116)
	at co.cask.cdap.internal.AppFabricTestHelper.deployApplicationWithManager(AppFabricTestHelper.java:246)
	at co.cask.cdap.internal.AppFabricTestHelper.deployApplicationWithManager(AppFabricTestHelper.java:228)
	at co.cask.cdap.internal.AppFabricTestHelper.deployApplicationWithManager(AppFabricTestHelper.java:217)
	at co.cask.cdap.internal.app.runtime.batch.MapReduceRunnerTestBase.deployApp(MapReduceRunnerTestBase.java:185)
(81 more lines...)
Collapse Failed ApplicationLifecycleServiceTest testMissingDependency History
Unit Tests 1 min
java.lang.AssertionError: expected:<200> but was:<500>
	at org.junit.Assert.fail(Assert.java:88)
	at org.junit.Assert.failNotEquals(Assert.java:743)
	at org.junit.Assert.assertEquals(Assert.java:118)
	at org.junit.Assert.assertEquals(Assert.java:555)
	at org.junit.Assert.assertEquals(Assert.java:542)
	at co.cask.cdap.internal.app.services.http.AppFabricTestBase.startProgram(AppFabricTestBase.java:726)
	at co.cask.cdap.internal.app.services.http.AppFabricTestBase.startProgram(AppFabricTestBase.java:698)
(47 more lines...)