Build #83

Build: #83 failed Changes by Chengfeng Mao <mao@cask.co>

Build result summary

Details

Completed
Duration
5 minutes
Labels
None
Agent
bamboo-agent15
Revision
70f48861c37bc811faae42997ef5bfdbe68d12db 70f48861c37bc811faae42997ef5bfdbe68d12db

No failed tests found, a possible compilation error occurred.

Responsible

No one has taken responsibility for this failure

Code commits

Author Commit Message Commit date
Chengfeng Mao &lt;mao@cask.co&gt; Chengfeng Mao <mao@cask.co> 70f48861c37bc811faae42997ef5bfdbe68d12db 70f48861c37bc811faae42997ef5bfdbe68d12db Merge pull request #9315 from caskdata/feature/composite-trigger-new
[CDAP-12232] Add composite trigger for scheduling
Chengfeng &lt;mao@cask.co&gt; Chengfeng <mao@cask.co> ec9ca6e53acb886ba40a5067d1eabcbf5e8e102e m ec9ca6e53acb886ba40a5067d1eabcbf5e8e102e [CDAP-12232] Add composite trigger for scheduling

JIRA issues

IssueDescriptionStatus
Unknown Issue TypeCDAP-12232Could not obtain issue details from JIRA

Shared artifacts

Artifact File size
UI Preview Pack 0 bytes
Variables 0 bytes

Error summary for Build Artifacts

The job generated some errors, drill down into the full build log for more details.

npm WARN deprecated babel-preset-es2017@6.24.1: We're really excited that you're trying to use ES2017 syntax, but instead of making more yearly presets, Babel has a better preset that we recommend you use instead: npm install babel-preset-env --save-dev. Give us a follow @babeljs to get more updates
npm WARN deprecated tough-cookie@2.2.2: ReDoS vulnerability parsing Set-Cookie https://nodesecurity.io/advisories/130
npm WARN deprecated bower@1.7.2: ..psst! While Bower is maintained, we recommend Yarn and Webpack for *new* front-end projects! Yarn's advantage is security and reliability, and Webpack's is support for both CommonJS and AMD projects. Currently there's no migration path, but please help to create it: https://github.com/bower/bower/issues/2467
npm WARN deprecated minimatch@2.0.10: Please update to minimatch 3.0.2 or higher to avoid a RegExp DoS issue
npm WARN deprecated express@2.5.11: express 2.x series is deprecated
npm WARN deprecated connect@1.9.2: connect 1.x series is deprecated
npm WARN deprecated minimatch@0.2.14: Please update to minimatch 3.0.2 or higher to avoid a RegExp DoS issue
npm WARN deprecated graceful-fs@1.2.3: graceful-fs v3.0.0 and before will fail on node releases >= v7.0. Please update to graceful-fs@^4.0.0 as soon as possible. Use 'npm ls graceful-fs' to find it in the tree.
npm WARN deprecated minimatch@0.3.0: Please update to minimatch 3.0.2 or higher to avoid a RegExp DoS issue
npm WARN prefer global marked@0.3.6 should be installed with -g
npm WARN prefer global colorguard@1.2.0 should be installed with -g
npm WARN prefer global node-gyp@3.6.2 should be installed with -g
npm WARN optional Skipping failed optional dependency /chokidar/fsevents:
npm WARN notsup Not compatible with your operating system or architecture: fsevents@1.1.2
npm WARN ngreact@0.3.0 requires a peer of angular@< 2.0.0 but none was installed.
npm WARN react-datetime@2.8.6 requires a peer of moment@>=2.16.0 but none was installed.
npm WARN react-test-renderer@15.6.1 requires a peer of react@^15.6.1 but none was installed.
npm WARN react-addons-test-utils@15.3.2 requires a peer of react@^15.3.2 but none was installed.
npm WARN stylelint-webpack-plugin@0.4.2 requires a peer of stylelint@^7.7.0 but none was installed.
npm WARN postcss-reporter@4.0.0 requires a peer of postcss@^6.0.0 but none was installed.
npm WARN cdap-ui@4.3.0-SNAPSHOT No license field.
npm WARN cdap-ui-upgrade@1.0.0 No repository field.
bower angular-ui-ace#bower                     invalid-meta angular-ui-ace is missing "ignore" entry in bower.json

npm ERR! Linux 2.6.32-642.3.1.el6.x86_64
npm ERR! argv "/var/bamboo/xml-data/build-dir/CDAP-BPP-BMA/cdap/cdap-ui/node/node" "/var/bamboo/xml-data/build-dir/CDAP-BPP-BMA/cdap/cdap-ui/node/npm/bin/npm-cli.js" "run" "cdap-prod-build"
npm ERR! node v4.5.0
npm ERR! npm  v3.8.8
npm ERR! code ELIFECYCLE
npm ERR! cdap-ui@4.3.0-SNAPSHOT cdap-prod-build: `NODE_ENV=production parallel-webpack`
npm ERR! Exit status 1
npm ERR!
npm ERR! Failed at the cdap-ui@4.3.0-SNAPSHOT cdap-prod-build script 'NODE_ENV=production parallel-webpack'.
npm ERR! Make sure you have the latest version of node.js and npm installed.
npm ERR! If you do, this is most likely a problem with the cdap-ui package,
npm ERR! not with npm itself.
npm ERR! Tell the author that this fails on your system:
npm ERR!     NODE_ENV=production parallel-webpack
npm ERR! You can get information on how to open an issue for this project with:
npm ERR!     npm bugs cdap-ui
npm ERR! Or if that isn't available, you can get their info via:
npm ERR!     npm owner ls cdap-ui
npm ERR! There is likely additional logging output above.

npm ERR! Please include the following file with any support request:
npm ERR!     /var/bamboo/xml-data/build-dir/CDAP-BPP-BMA/cdap/cdap-ui/npm-debug.log
events.js:141
      throw er; // Unhandled 'error' event
      ^

Error: channel closed
    at process.target.send (internal/child_process.js:510:16)
    at callback (/var/bamboo/xml-data/build-dir/CDAP-BPP-BMA/cdap/cdap-ui/node_modules/worker-farm/lib/child/index.js:32:17)
    at finishedCallback (/var/bamboo/xml-data/build-dir/CDAP-BPP-BMA/cdap/cdap-ui/node_modules/parallel-webpack/src/webpackWorker.js:118:32)
    at Compiler.<anonymous> (/var/bamboo/xml-data/build-dir/CDAP-BPP-BMA/cdap/cdap-ui/node_modules/webpack/lib/Compiler.js:194:14)
    at Compiler.emitRecords (/var/bamboo/xml-data/build-dir/CDAP-BPP-BMA/cdap/cdap-ui/node_modules/webpack/lib/Compiler.js:282:37)
    at Compiler.<anonymous> (/var/bamboo/xml-data/build-dir/CDAP-BPP-BMA/cdap/cdap-ui/node_modules/webpack/lib/Compiler.js:187:11)
    at /var/bamboo/xml-data/build-dir/CDAP-BPP-BMA/cdap/cdap-ui/node_modules/webpack/lib/Compiler.js:275:11
    at Compiler.next (/var/bamboo/xml-data/build-dir/CDAP-BPP-BMA/cdap/cdap-ui/node_modules/tapable/lib/Tapable.js:67:11)
    at Compiler.<anonymous> (/var/bamboo/xml-data/build-dir/CDAP-BPP-BMA/cdap/cdap-ui/node_modules/copy-webpack-plugin/dist/index.js:190:13)
    at Compiler.applyPluginsAsync (/var/bamboo/xml-data/build-dir/CDAP-BPP-BMA/cdap/cdap-ui/node_modules/tapable/lib/Tapable.js:71:13)
    at Compiler.afterEmit (/var/bamboo/xml-data/build-dir/CDAP-BPP-BMA/cdap/cdap-ui/node_modules/webpack/lib/Compiler.js:272:8)
    at Compiler.<anonymous> (/var/bamboo/xml-data/build-dir/CDAP-BPP-BMA/cdap/cdap-ui/node_modules/webpack/lib/Compiler.js:267:14)
    at /var/bamboo/xml-data/build-dir/CDAP-BPP-BMA/cdap/cdap-ui/node_modules/webpack/node_modules/async/lib/async.js:52:16
    at done (/var/bamboo/xml-data/build-dir/CDAP-BPP-BMA/cdap/cdap-ui/node_modules/webpack/node_modules/async/lib/async.js:246:17)
    at /var/bamboo/xml-data/build-dir/CDAP-BPP-BMA/cdap/cdap-ui/node_modules/webpack/node_modules/async/lib/async.js:44:16
    at /var/bamboo/xml-data/build-dir/CDAP-BPP-BMA/cdap/cdap-ui/node_modules/graceful-fs/graceful-fs.js:43:10
    at FSReqWrap.oncomplete (fs.js:82:15)
events.js:141
      throw er; // Unhandled 'error' event
      ^

Error: channel closed
    at process.target.send (internal/child_process.js:510:16)
    at callback (/var/bamboo/xml-data/build-dir/CDAP-BPP-BMA/cdap/cdap-ui/node_modules/worker-farm/lib/child/index.js:32:17)
    at finishedCallback (/var/bamboo/xml-data/build-dir/CDAP-BPP-BMA/cdap/cdap-ui/node_modules/parallel-webpack/src/webpackWorker.js:118:32)
    at Compiler.<anonymous> (/var/bamboo/xml-data/build-dir/CDAP-BPP-BMA/cdap/cdap-ui/node_modules/webpack/lib/Compiler.js:194:14)
    at Compiler.emitRecords (/var/bamboo/xml-data/build-dir/CDAP-BPP-BMA/cdap/cdap-ui/node_modules/webpack/lib/Compiler.js:282:37)
    at Compiler.<anonymous> (/var/bamboo/xml-data/build-dir/CDAP-BPP-BMA/cdap/cdap-ui/node_modules/webpack/lib/Compiler.js:187:11)
    at /var/bamboo/xml-data/build-dir/CDAP-BPP-BMA/cdap/cdap-ui/node_modules/webpack/lib/Compiler.js:275:11
    at Compiler.applyPluginsAsync (/var/bamboo/xml-data/build-dir/CDAP-BPP-BMA/cdap/cdap-ui/node_modules/tapable/lib/Tapable.js:60:69)
    at Compiler.afterEmit (/var/bamboo/xml-data/build-dir/CDAP-BPP-BMA/cdap/cdap-ui/node_modules/webpack/lib/Compiler.js:272:8)
    at Compiler.<anonymous> (/var/bamboo/xml-data/build-dir/CDAP-BPP-BMA/cdap/cdap-ui/node_modules/webpack/lib/Compiler.js:267:14)
    at /var/bamboo/xml-data/build-dir/CDAP-BPP-BMA/cdap/cdap-ui/node_modules/webpack/node_modules/async/lib/async.js:52:16
    at done (/var/bamboo/xml-data/build-dir/CDAP-BPP-BMA/cdap/cdap-ui/node_modules/webpack/node_modules/async/lib/async.js:246:17)
    at /var/bamboo/xml-data/build-dir/CDAP-BPP-BMA/cdap/cdap-ui/node_modules/webpack/node_modules/async/lib/async.js:44:16
    at /var/bamboo/xml-data/build-dir/CDAP-BPP-BMA/cdap/cdap-ui/node_modules/graceful-fs/graceful-fs.js:43:10
    at FSReqWrap.oncomplete (fs.js:82:15)