[WIP] Integration tests for authentication (against Sentry)

Build: #1 failed Manual run by Ali Anwar

Build result summary

Details

Completed
Duration
54 minutes
Labels
None
Agent
bamboo-agent15
Revisions
CDAP Integration Tests
e893e9156151f82fc232def5f502d71750e7a921 e893e9156151f82fc232def5f502d71750e7a921
Coopr-internal
8a6a163d7cb41c3ce907851d74f36095bfbc1544 8a6a163d7cb41c3ce907851d74f36095bfbc1544
Total tests
45

Responsible

No one has taken responsibility for this failure

Tests

New test failures 42
Status Test View job Duration
Collapse Failed BatchAggregatorTest test History
Cloudera Manager Tests - 5.7 < 1 sec
java.lang.IllegalStateException: Program state for 'program:default.groupby-test.workflow.DataPipelineWorkflow' not as expected. Expected 'false'.
	at co.cask.cdap.test.AbstractProgramManager.waitForStatus(AbstractProgramManager.java:105)
	at co.cask.cdap.test.AbstractProgramManager.waitForFinish(AbstractProgramManager.java:69)
	at co.cask.cdap.app.etl.batch.BatchAggregatorTest.test(BatchAggregatorTest.java:160)
Collapse Failed BatchCubeSinkTest test History
Cloudera Manager Tests - 5.7 1 sec
java.lang.AssertionError: Must have no deployed apps, but found the following apps: groupby-test, purchaseSource, DatasetAccessApp
	at org.junit.Assert.fail(Assert.java:88)
	at org.junit.Assert.assertTrue(Assert.java:41)
	at co.cask.cdap.test.IntegrationTestBase.assertNoApps(IntegrationTestBase.java:424)
	at co.cask.cdap.test.IntegrationTestBase.assertIsClear(IntegrationTestBase.java:382)
	at co.cask.cdap.test.IntegrationTestBase.setUp(IntegrationTestBase.java:108)
	at sun.reflect.NativeMethodAccessorImpl.invoke0(Native Method)
	at sun.reflect.NativeMethodAccessorImpl.invoke(NativeMethodAccessorImpl.java:57)
(33 more lines...)
Collapse Failed CopybookReaderTest test History
Cloudera Manager Tests - 5.7 1 sec
java.lang.AssertionError: Must have no deployed apps, but found the following apps: groupby-test, purchaseSource, DatasetAccessApp
	at org.junit.Assert.fail(Assert.java:88)
	at org.junit.Assert.assertTrue(Assert.java:41)
	at co.cask.cdap.test.IntegrationTestBase.assertNoApps(IntegrationTestBase.java:424)
	at co.cask.cdap.test.IntegrationTestBase.assertIsClear(IntegrationTestBase.java:382)
	at co.cask.cdap.test.IntegrationTestBase.setUp(IntegrationTestBase.java:108)
	at sun.reflect.NativeMethodAccessorImpl.invoke0(Native Method)
	at sun.reflect.NativeMethodAccessorImpl.invoke(NativeMethodAccessorImpl.java:57)
(33 more lines...)
Collapse Failed ETLMapReduceTest testDAG History
Cloudera Manager Tests - 5.7 1 sec
java.lang.AssertionError: Must have no deployed apps, but found the following apps: groupby-test, purchaseSource, DatasetAccessApp
	at org.junit.Assert.fail(Assert.java:88)
	at org.junit.Assert.assertTrue(Assert.java:41)
	at co.cask.cdap.test.IntegrationTestBase.assertNoApps(IntegrationTestBase.java:424)
	at co.cask.cdap.test.IntegrationTestBase.assertIsClear(IntegrationTestBase.java:382)
	at co.cask.cdap.test.IntegrationTestBase.setUp(IntegrationTestBase.java:108)
	at sun.reflect.NativeMethodAccessorImpl.invoke0(Native Method)
	at sun.reflect.NativeMethodAccessorImpl.invoke(NativeMethodAccessorImpl.java:57)
(33 more lines...)
Collapse Failed ETLMapReduceTest testTableToTableWithValidations History
Cloudera Manager Tests - 5.7 1 sec
java.lang.AssertionError: Must have no deployed apps, but found the following apps: groupby-test, purchaseSource, DatasetAccessApp
	at org.junit.Assert.fail(Assert.java:88)
	at org.junit.Assert.assertTrue(Assert.java:41)
	at co.cask.cdap.test.IntegrationTestBase.assertNoApps(IntegrationTestBase.java:424)
	at co.cask.cdap.test.IntegrationTestBase.assertIsClear(IntegrationTestBase.java:382)
	at co.cask.cdap.test.IntegrationTestBase.setUp(IntegrationTestBase.java:108)
	at sun.reflect.NativeMethodAccessorImpl.invoke0(Native Method)
	at sun.reflect.NativeMethodAccessorImpl.invoke(NativeMethodAccessorImpl.java:57)
(33 more lines...)
Collapse Failed ETLMapReduceTest testDAGSchemaChanges History
Cloudera Manager Tests - 5.7 1 sec
java.lang.AssertionError: Must have no deployed apps, but found the following apps: groupby-test, purchaseSource, DatasetAccessApp
	at org.junit.Assert.fail(Assert.java:88)
	at org.junit.Assert.assertTrue(Assert.java:41)
	at co.cask.cdap.test.IntegrationTestBase.assertNoApps(IntegrationTestBase.java:424)
	at co.cask.cdap.test.IntegrationTestBase.assertIsClear(IntegrationTestBase.java:382)
	at co.cask.cdap.test.IntegrationTestBase.setUp(IntegrationTestBase.java:108)
	at sun.reflect.NativeMethodAccessorImpl.invoke0(Native Method)
	at sun.reflect.NativeMethodAccessorImpl.invoke(NativeMethodAccessorImpl.java:57)
(33 more lines...)
Collapse Failed ETLMapReduceTest testKVToKV History
Cloudera Manager Tests - 5.7 1 sec
java.lang.AssertionError: Must have no deployed apps, but found the following apps: groupby-test, purchaseSource, DatasetAccessApp
	at org.junit.Assert.fail(Assert.java:88)
	at org.junit.Assert.assertTrue(Assert.java:41)
	at co.cask.cdap.test.IntegrationTestBase.assertNoApps(IntegrationTestBase.java:424)
	at co.cask.cdap.test.IntegrationTestBase.assertIsClear(IntegrationTestBase.java:382)
	at co.cask.cdap.test.IntegrationTestBase.setUp(IntegrationTestBase.java:108)
	at sun.reflect.NativeMethodAccessorImpl.invoke0(Native Method)
	at sun.reflect.NativeMethodAccessorImpl.invoke(NativeMethodAccessorImpl.java:57)
(33 more lines...)
Collapse Failed ETLMapReduceTest testDAGInvalidSchema History
Cloudera Manager Tests - 5.7 1 sec
java.lang.AssertionError: Must have no deployed apps, but found the following apps: groupby-test, purchaseSource, DatasetAccessApp
	at org.junit.Assert.fail(Assert.java:88)
	at org.junit.Assert.assertTrue(Assert.java:41)
	at co.cask.cdap.test.IntegrationTestBase.assertNoApps(IntegrationTestBase.java:424)
	at co.cask.cdap.test.IntegrationTestBase.assertIsClear(IntegrationTestBase.java:382)
	at co.cask.cdap.test.IntegrationTestBase.setUp(IntegrationTestBase.java:108)
	at sun.reflect.NativeMethodAccessorImpl.invoke0(Native Method)
	at sun.reflect.NativeMethodAccessorImpl.invoke(NativeMethodAccessorImpl.java:57)
(33 more lines...)
Collapse Failed ExcelInputReaderTest testExcelReaderReprocessFalse History
Cloudera Manager Tests - 5.7 1 sec
java.lang.AssertionError: Must have no deployed apps, but found the following apps: groupby-test, purchaseSource, DatasetAccessApp
	at org.junit.Assert.fail(Assert.java:88)
	at org.junit.Assert.assertTrue(Assert.java:41)
	at co.cask.cdap.test.IntegrationTestBase.assertNoApps(IntegrationTestBase.java:424)
	at co.cask.cdap.test.IntegrationTestBase.assertIsClear(IntegrationTestBase.java:382)
	at co.cask.cdap.test.IntegrationTestBase.setUp(IntegrationTestBase.java:108)
	at sun.reflect.NativeMethodAccessorImpl.invoke0(Native Method)
	at sun.reflect.NativeMethodAccessorImpl.invoke(NativeMethodAccessorImpl.java:57)
(33 more lines...)
Collapse Failed ExcelInputReaderTest testExcelReader History
Cloudera Manager Tests - 5.7 1 sec
java.lang.AssertionError: Must have no deployed apps, but found the following apps: groupby-test, purchaseSource, DatasetAccessApp
	at org.junit.Assert.fail(Assert.java:88)
	at org.junit.Assert.assertTrue(Assert.java:41)
	at co.cask.cdap.test.IntegrationTestBase.assertNoApps(IntegrationTestBase.java:424)
	at co.cask.cdap.test.IntegrationTestBase.assertIsClear(IntegrationTestBase.java:382)
	at co.cask.cdap.test.IntegrationTestBase.setUp(IntegrationTestBase.java:108)
	at sun.reflect.NativeMethodAccessorImpl.invoke0(Native Method)
	at sun.reflect.NativeMethodAccessorImpl.invoke(NativeMethodAccessorImpl.java:57)
(33 more lines...)
Collapse Failed ExcelInputReaderTest testTerminateOnErrorRecord History
Cloudera Manager Tests - 5.7 1 sec
java.lang.AssertionError: Must have no deployed apps, but found the following apps: groupby-test, purchaseSource, DatasetAccessApp
	at org.junit.Assert.fail(Assert.java:88)
	at org.junit.Assert.assertTrue(Assert.java:41)
	at co.cask.cdap.test.IntegrationTestBase.assertNoApps(IntegrationTestBase.java:424)
	at co.cask.cdap.test.IntegrationTestBase.assertIsClear(IntegrationTestBase.java:382)
	at co.cask.cdap.test.IntegrationTestBase.setUp(IntegrationTestBase.java:108)
	at sun.reflect.NativeMethodAccessorImpl.invoke0(Native Method)
	at sun.reflect.NativeMethodAccessorImpl.invoke(NativeMethodAccessorImpl.java:57)
(33 more lines...)
Collapse Failed ExcelInputReaderTest testTerminateOnEmptyRow History
Cloudera Manager Tests - 5.7 1 sec
java.lang.AssertionError: Must have no deployed apps, but found the following apps: groupby-test, purchaseSource, DatasetAccessApp
	at org.junit.Assert.fail(Assert.java:88)
	at org.junit.Assert.assertTrue(Assert.java:41)
	at co.cask.cdap.test.IntegrationTestBase.assertNoApps(IntegrationTestBase.java:424)
	at co.cask.cdap.test.IntegrationTestBase.assertIsClear(IntegrationTestBase.java:382)
	at co.cask.cdap.test.IntegrationTestBase.setUp(IntegrationTestBase.java:108)
	at sun.reflect.NativeMethodAccessorImpl.invoke0(Native Method)
	at sun.reflect.NativeMethodAccessorImpl.invoke(NativeMethodAccessorImpl.java:57)
(33 more lines...)
Collapse Failed NormalizeTest testNormalizeWithEmptyAttributeValue History
Cloudera Manager Tests - 5.7 1 sec
java.lang.AssertionError: Must have no deployed apps, but found the following apps: groupby-test, purchaseSource, DatasetAccessApp
	at org.junit.Assert.fail(Assert.java:88)
	at org.junit.Assert.assertTrue(Assert.java:41)
	at co.cask.cdap.test.IntegrationTestBase.assertNoApps(IntegrationTestBase.java:424)
	at co.cask.cdap.test.IntegrationTestBase.assertIsClear(IntegrationTestBase.java:382)
	at co.cask.cdap.test.IntegrationTestBase.setUp(IntegrationTestBase.java:108)
	at sun.reflect.GeneratedMethodAccessor2.invoke(Unknown Source)
	at sun.reflect.DelegatingMethodAccessorImpl.invoke(DelegatingMethodAccessorImpl.java:43)
(33 more lines...)
Collapse Failed NormalizeTest testNormalize History
Cloudera Manager Tests - 5.7 1 sec
java.lang.AssertionError: Must have no deployed apps, but found the following apps: groupby-test, purchaseSource, DatasetAccessApp
	at org.junit.Assert.fail(Assert.java:88)
	at org.junit.Assert.assertTrue(Assert.java:41)
	at co.cask.cdap.test.IntegrationTestBase.assertNoApps(IntegrationTestBase.java:424)
	at co.cask.cdap.test.IntegrationTestBase.assertIsClear(IntegrationTestBase.java:382)
	at co.cask.cdap.test.IntegrationTestBase.setUp(IntegrationTestBase.java:108)
	at sun.reflect.GeneratedMethodAccessor2.invoke(Unknown Source)
	at sun.reflect.DelegatingMethodAccessorImpl.invoke(DelegatingMethodAccessorImpl.java:43)
(33 more lines...)
Collapse Failed RowDenormalizerTest test History
Cloudera Manager Tests - 5.7 1 sec
java.lang.AssertionError: Must have no deployed apps, but found the following apps: groupby-test, purchaseSource, DatasetAccessApp
	at org.junit.Assert.fail(Assert.java:88)
	at org.junit.Assert.assertTrue(Assert.java:41)
	at co.cask.cdap.test.IntegrationTestBase.assertNoApps(IntegrationTestBase.java:424)
	at co.cask.cdap.test.IntegrationTestBase.assertIsClear(IntegrationTestBase.java:382)
	at co.cask.cdap.test.IntegrationTestBase.setUp(IntegrationTestBase.java:108)
	at sun.reflect.GeneratedMethodAccessor2.invoke(Unknown Source)
	at sun.reflect.DelegatingMethodAccessorImpl.invoke(DelegatingMethodAccessorImpl.java:43)
(32 more lines...)
Collapse Failed SparkPluginsTest testSparkPlugins History
Cloudera Manager Tests - 5.7 1 sec
java.lang.AssertionError: Must have no deployed apps, but found the following apps: groupby-test, purchaseSource, DatasetAccessApp
	at org.junit.Assert.fail(Assert.java:88)
	at org.junit.Assert.assertTrue(Assert.java:41)
	at co.cask.cdap.test.IntegrationTestBase.assertNoApps(IntegrationTestBase.java:424)
	at co.cask.cdap.test.IntegrationTestBase.assertIsClear(IntegrationTestBase.java:382)
	at co.cask.cdap.test.IntegrationTestBase.setUp(IntegrationTestBase.java:108)
	at sun.reflect.GeneratedMethodAccessor2.invoke(Unknown Source)
	at sun.reflect.DelegatingMethodAccessorImpl.invoke(DelegatingMethodAccessorImpl.java:43)
(32 more lines...)
Collapse Failed ValueMapperTest test History
Cloudera Manager Tests - 5.7 1 sec
java.lang.AssertionError: Must have no deployed apps, but found the following apps: groupby-test, purchaseSource, DatasetAccessApp
	at org.junit.Assert.fail(Assert.java:88)
	at org.junit.Assert.assertTrue(Assert.java:41)
	at co.cask.cdap.test.IntegrationTestBase.assertNoApps(IntegrationTestBase.java:424)
	at co.cask.cdap.test.IntegrationTestBase.assertIsClear(IntegrationTestBase.java:382)
	at co.cask.cdap.test.IntegrationTestBase.setUp(IntegrationTestBase.java:108)
	at sun.reflect.GeneratedMethodAccessor2.invoke(Unknown Source)
	at sun.reflect.DelegatingMethodAccessorImpl.invoke(DelegatingMethodAccessorImpl.java:43)
(32 more lines...)
Collapse Failed RealtimeCubeSinkTest test History
Cloudera Manager Tests - 5.7 1 sec
java.lang.AssertionError: Must have no deployed apps, but found the following apps: groupby-test, purchaseSource, DatasetAccessApp
	at org.junit.Assert.fail(Assert.java:88)
	at org.junit.Assert.assertTrue(Assert.java:41)
	at co.cask.cdap.test.IntegrationTestBase.assertNoApps(IntegrationTestBase.java:424)
	at co.cask.cdap.test.IntegrationTestBase.assertIsClear(IntegrationTestBase.java:382)
	at co.cask.cdap.test.IntegrationTestBase.setUp(IntegrationTestBase.java:108)
	at sun.reflect.GeneratedMethodAccessor2.invoke(Unknown Source)
	at sun.reflect.DelegatingMethodAccessorImpl.invoke(DelegatingMethodAccessorImpl.java:43)
(32 more lines...)
Collapse Failed HangingWorkerTest testRestart History
Cloudera Manager Tests - 5.7 1 sec
java.lang.AssertionError: Must have no deployed apps, but found the following apps: groupby-test, purchaseSource, DatasetAccessApp
	at org.junit.Assert.fail(Assert.java:88)
	at org.junit.Assert.assertTrue(Assert.java:41)
	at co.cask.cdap.test.IntegrationTestBase.assertNoApps(IntegrationTestBase.java:424)
	at co.cask.cdap.test.IntegrationTestBase.assertIsClear(IntegrationTestBase.java:382)
	at co.cask.cdap.test.IntegrationTestBase.setUp(IntegrationTestBase.java:108)
	at sun.reflect.GeneratedMethodAccessor2.invoke(Unknown Source)
	at sun.reflect.DelegatingMethodAccessorImpl.invoke(DelegatingMethodAccessorImpl.java:43)
(32 more lines...)
Collapse Failed ApplicationTest test History
Cloudera Manager Tests - 5.7 32 secs
co.cask.cdap.common.BadRequestException: Bad request: Cannot create the namespace 'default'. 'default' is a reserved namespace.
	at co.cask.cdap.common.namespace.AbstractNamespaceClient.create(AbstractNamespaceClient.java:68)
	at co.cask.cdap.test.IntegrationTestBase.setUp(IntegrationTestBase.java:103)
	at sun.reflect.NativeMethodAccessorImpl.invoke0(Native Method)
	at sun.reflect.NativeMethodAccessorImpl.invoke(NativeMethodAccessorImpl.java:57)
	at sun.reflect.DelegatingMethodAccessorImpl.invoke(DelegatingMethodAccessorImpl.java:43)
	at java.lang.reflect.Method.invoke(Method.java:606)
	at org.junit.runners.model.FrameworkMethod$1.runReflectiveCall(FrameworkMethod.java:47)
(30 more lines...)
Collapse Failed DatasetTest test History
Cloudera Manager Tests - 5.7 1 sec
java.lang.AssertionError: Must have no deployed apps, but found the following apps: groupby-test, purchaseSource, DatasetAccessApp
	at org.junit.Assert.fail(Assert.java:88)
	at org.junit.Assert.assertTrue(Assert.java:41)
	at co.cask.cdap.test.IntegrationTestBase.assertNoApps(IntegrationTestBase.java:424)
	at co.cask.cdap.test.IntegrationTestBase.assertIsClear(IntegrationTestBase.java:382)
	at co.cask.cdap.test.IntegrationTestBase.setUp(IntegrationTestBase.java:108)
	at sun.reflect.NativeMethodAccessorImpl.invoke0(Native Method)
	at sun.reflect.NativeMethodAccessorImpl.invoke(NativeMethodAccessorImpl.java:57)
(33 more lines...)
Collapse Failed NamespaceTest testNamespaces History
Cloudera Manager Tests - 5.7 1 sec
java.lang.AssertionError: Must have no deployed apps, but found the following apps: groupby-test, purchaseSource, DatasetAccessApp
	at org.junit.Assert.fail(Assert.java:88)
	at org.junit.Assert.assertTrue(Assert.java:41)
	at co.cask.cdap.test.IntegrationTestBase.assertNoApps(IntegrationTestBase.java:424)
	at co.cask.cdap.test.IntegrationTestBase.assertIsClear(IntegrationTestBase.java:382)
	at co.cask.cdap.test.IntegrationTestBase.setUp(IntegrationTestBase.java:108)
	at sun.reflect.GeneratedMethodAccessor2.invoke(Unknown Source)
	at sun.reflect.DelegatingMethodAccessorImpl.invoke(DelegatingMethodAccessorImpl.java:43)
(32 more lines...)
Collapse Failed NamespacedStreamTest testNamespacedStreams History
Cloudera Manager Tests - 5.7 1 sec
java.lang.AssertionError: Must have no deployed apps, but found the following apps: groupby-test, purchaseSource, DatasetAccessApp
	at org.junit.Assert.fail(Assert.java:88)
	at org.junit.Assert.assertTrue(Assert.java:41)
	at co.cask.cdap.test.IntegrationTestBase.assertNoApps(IntegrationTestBase.java:424)
	at co.cask.cdap.test.IntegrationTestBase.assertIsClear(IntegrationTestBase.java:382)
	at co.cask.cdap.test.IntegrationTestBase.setUp(IntegrationTestBase.java:108)
	at sun.reflect.GeneratedMethodAccessor2.invoke(Unknown Source)
	at sun.reflect.DelegatingMethodAccessorImpl.invoke(DelegatingMethodAccessorImpl.java:43)
(32 more lines...)
Collapse Failed StreamTest testNonexistentStreams History
Cloudera Manager Tests - 5.7 1 sec
java.lang.AssertionError: Must have no deployed apps, but found the following apps: groupby-test, purchaseSource, DatasetAccessApp
	at org.junit.Assert.fail(Assert.java:88)
	at org.junit.Assert.assertTrue(Assert.java:41)
	at co.cask.cdap.test.IntegrationTestBase.assertNoApps(IntegrationTestBase.java:424)
	at co.cask.cdap.test.IntegrationTestBase.assertIsClear(IntegrationTestBase.java:382)
	at co.cask.cdap.test.IntegrationTestBase.setUp(IntegrationTestBase.java:108)
	at sun.reflect.GeneratedMethodAccessor2.invoke(Unknown Source)
	at sun.reflect.DelegatingMethodAccessorImpl.invoke(DelegatingMethodAccessorImpl.java:43)
(32 more lines...)
Collapse Failed StreamTest testStreams History
Cloudera Manager Tests - 5.7 1 sec
java.lang.AssertionError: Must have no deployed apps, but found the following apps: groupby-test, purchaseSource, DatasetAccessApp
	at org.junit.Assert.fail(Assert.java:88)
	at org.junit.Assert.assertTrue(Assert.java:41)
	at co.cask.cdap.test.IntegrationTestBase.assertNoApps(IntegrationTestBase.java:424)
	at co.cask.cdap.test.IntegrationTestBase.assertIsClear(IntegrationTestBase.java:382)
	at co.cask.cdap.test.IntegrationTestBase.setUp(IntegrationTestBase.java:108)
	at sun.reflect.GeneratedMethodAccessor2.invoke(Unknown Source)
	at sun.reflect.DelegatingMethodAccessorImpl.invoke(DelegatingMethodAccessorImpl.java:43)
(32 more lines...)
Collapse Failed ExploreTest test History
Cloudera Manager Tests - 5.7 1 sec
java.lang.AssertionError: Must have no deployed apps, but found the following apps: groupby-test, purchaseSource, DatasetAccessApp
	at org.junit.Assert.fail(Assert.java:88)
	at org.junit.Assert.assertTrue(Assert.java:41)
	at co.cask.cdap.test.IntegrationTestBase.assertNoApps(IntegrationTestBase.java:424)
	at co.cask.cdap.test.IntegrationTestBase.assertIsClear(IntegrationTestBase.java:382)
	at co.cask.cdap.test.IntegrationTestBase.setUp(IntegrationTestBase.java:108)
	at sun.reflect.NativeMethodAccessorImpl.invoke0(Native Method)
	at sun.reflect.NativeMethodAccessorImpl.invoke(NativeMethodAccessorImpl.java:57)
(33 more lines...)
Collapse Failed ExploreTest testSubqueryInWhereClause History
Cloudera Manager Tests - 5.7 1 sec
java.lang.AssertionError: Must have no deployed apps, but found the following apps: groupby-test, purchaseSource, DatasetAccessApp
	at org.junit.Assert.fail(Assert.java:88)
	at org.junit.Assert.assertTrue(Assert.java:41)
	at co.cask.cdap.test.IntegrationTestBase.assertNoApps(IntegrationTestBase.java:424)
	at co.cask.cdap.test.IntegrationTestBase.assertIsClear(IntegrationTestBase.java:382)
	at co.cask.cdap.test.IntegrationTestBase.setUp(IntegrationTestBase.java:108)
	at sun.reflect.NativeMethodAccessorImpl.invoke0(Native Method)
	at sun.reflect.NativeMethodAccessorImpl.invoke(NativeMethodAccessorImpl.java:57)
(33 more lines...)
Collapse Failed FileSetTest test History
Cloudera Manager Tests - 5.7 1 sec
java.lang.AssertionError: Must have no deployed apps, but found the following apps: groupby-test, purchaseSource, DatasetAccessApp
	at org.junit.Assert.fail(Assert.java:88)
	at org.junit.Assert.assertTrue(Assert.java:41)
	at co.cask.cdap.test.IntegrationTestBase.assertNoApps(IntegrationTestBase.java:424)
	at co.cask.cdap.test.IntegrationTestBase.assertIsClear(IntegrationTestBase.java:382)
	at co.cask.cdap.test.IntegrationTestBase.setUp(IntegrationTestBase.java:108)
	at sun.reflect.GeneratedMethodAccessor2.invoke(Unknown Source)
	at sun.reflect.DelegatingMethodAccessorImpl.invoke(DelegatingMethodAccessorImpl.java:43)
(32 more lines...)
Collapse Failed PartitionCorrectorTest test History
Cloudera Manager Tests - 5.7 1 sec
java.lang.AssertionError: Must have no deployed apps, but found the following apps: groupby-test, purchaseSource, DatasetAccessApp
	at org.junit.Assert.fail(Assert.java:88)
	at org.junit.Assert.assertTrue(Assert.java:41)
	at co.cask.cdap.test.IntegrationTestBase.assertNoApps(IntegrationTestBase.java:424)
	at co.cask.cdap.test.IntegrationTestBase.assertIsClear(IntegrationTestBase.java:382)
	at co.cask.cdap.test.IntegrationTestBase.setUp(IntegrationTestBase.java:108)
	at sun.reflect.GeneratedMethodAccessor2.invoke(Unknown Source)
	at sun.reflect.DelegatingMethodAccessorImpl.invoke(DelegatingMethodAccessorImpl.java:43)
(32 more lines...)
Collapse Failed PartitionedFileSetUpdateTest test History
Cloudera Manager Tests - 5.7 1 sec
java.lang.AssertionError: Must have no deployed apps, but found the following apps: groupby-test, purchaseSource, DatasetAccessApp
	at org.junit.Assert.fail(Assert.java:88)
	at org.junit.Assert.assertTrue(Assert.java:41)
	at co.cask.cdap.test.IntegrationTestBase.assertNoApps(IntegrationTestBase.java:424)
	at co.cask.cdap.test.IntegrationTestBase.assertIsClear(IntegrationTestBase.java:382)
	at co.cask.cdap.test.IntegrationTestBase.setUp(IntegrationTestBase.java:108)
	at sun.reflect.GeneratedMethodAccessor2.invoke(Unknown Source)
	at sun.reflect.DelegatingMethodAccessorImpl.invoke(DelegatingMethodAccessorImpl.java:43)
(32 more lines...)
Collapse Failed PurchaseMetadataTest testSearchUsingSystemMetadata History
Cloudera Manager Tests - 5.7 1 sec
java.lang.AssertionError: Must have no deployed apps, but found the following apps: groupby-test, purchaseSource, DatasetAccessApp
	at org.junit.Assert.fail(Assert.java:88)
	at org.junit.Assert.assertTrue(Assert.java:41)
	at co.cask.cdap.test.IntegrationTestBase.assertNoApps(IntegrationTestBase.java:424)
	at co.cask.cdap.test.IntegrationTestBase.assertIsClear(IntegrationTestBase.java:382)
	at co.cask.cdap.test.IntegrationTestBase.setUp(IntegrationTestBase.java:108)
	at sun.reflect.GeneratedMethodAccessor2.invoke(Unknown Source)
	at sun.reflect.DelegatingMethodAccessorImpl.invoke(DelegatingMethodAccessorImpl.java:43)
(32 more lines...)
Collapse Failed PurchaseMetadataTest testLineage History
Cloudera Manager Tests - 5.7 1 sec
java.lang.AssertionError: Must have no deployed apps, but found the following apps: groupby-test, purchaseSource, DatasetAccessApp
	at org.junit.Assert.fail(Assert.java:88)
	at org.junit.Assert.assertTrue(Assert.java:41)
	at co.cask.cdap.test.IntegrationTestBase.assertNoApps(IntegrationTestBase.java:424)
	at co.cask.cdap.test.IntegrationTestBase.assertIsClear(IntegrationTestBase.java:382)
	at co.cask.cdap.test.IntegrationTestBase.setUp(IntegrationTestBase.java:108)
	at sun.reflect.GeneratedMethodAccessor2.invoke(Unknown Source)
	at sun.reflect.DelegatingMethodAccessorImpl.invoke(DelegatingMethodAccessorImpl.java:43)
(32 more lines...)
Collapse Failed PurchaseAudiTest test History
Cloudera Manager Tests - 5.7 1 sec
java.lang.AssertionError: Must have no deployed apps, but found the following apps: groupby-test, purchaseSource, DatasetAccessApp
	at org.junit.Assert.fail(Assert.java:88)
	at org.junit.Assert.assertTrue(Assert.java:41)
	at co.cask.cdap.test.IntegrationTestBase.assertNoApps(IntegrationTestBase.java:424)
	at co.cask.cdap.test.IntegrationTestBase.assertIsClear(IntegrationTestBase.java:382)
	at co.cask.cdap.test.IntegrationTestBase.setUp(IntegrationTestBase.java:108)
	at sun.reflect.GeneratedMethodAccessor2.invoke(Unknown Source)
	at sun.reflect.DelegatingMethodAccessorImpl.invoke(DelegatingMethodAccessorImpl.java:43)
(32 more lines...)
Collapse Failed StreamSchedulerTest test History
Cloudera Manager Tests - 5.7 1 sec
java.lang.AssertionError: Must have no deployed apps, but found the following apps: groupby-test, purchaseSource, DatasetAccessApp
	at org.junit.Assert.fail(Assert.java:88)
	at org.junit.Assert.assertTrue(Assert.java:41)
	at co.cask.cdap.test.IntegrationTestBase.assertNoApps(IntegrationTestBase.java:424)
	at co.cask.cdap.test.IntegrationTestBase.assertIsClear(IntegrationTestBase.java:382)
	at co.cask.cdap.test.IntegrationTestBase.setUp(IntegrationTestBase.java:108)
	at sun.reflect.GeneratedMethodAccessor2.invoke(Unknown Source)
	at sun.reflect.DelegatingMethodAccessorImpl.invoke(DelegatingMethodAccessorImpl.java:43)
(32 more lines...)
Collapse Failed ServiceWorkerTest test History
Cloudera Manager Tests - 5.7 1 sec
java.lang.AssertionError: Must have no deployed apps, but found the following apps: groupby-test, purchaseSource, DatasetAccessApp
	at org.junit.Assert.fail(Assert.java:88)
	at org.junit.Assert.assertTrue(Assert.java:41)
	at co.cask.cdap.test.IntegrationTestBase.assertNoApps(IntegrationTestBase.java:424)
	at co.cask.cdap.test.IntegrationTestBase.assertIsClear(IntegrationTestBase.java:382)
	at co.cask.cdap.test.IntegrationTestBase.setUp(IntegrationTestBase.java:108)
	at sun.reflect.GeneratedMethodAccessor2.invoke(Unknown Source)
	at sun.reflect.DelegatingMethodAccessorImpl.invoke(DelegatingMethodAccessorImpl.java:43)
(32 more lines...)
Collapse Failed SparkPageRankAppTest test History
Cloudera Manager Tests - 5.7 1 sec
java.lang.AssertionError: Must have no deployed apps, but found the following apps: groupby-test, purchaseSource, DatasetAccessApp
	at org.junit.Assert.fail(Assert.java:88)
	at org.junit.Assert.assertTrue(Assert.java:41)
	at co.cask.cdap.test.IntegrationTestBase.assertNoApps(IntegrationTestBase.java:424)
	at co.cask.cdap.test.IntegrationTestBase.assertIsClear(IntegrationTestBase.java:382)
	at co.cask.cdap.test.IntegrationTestBase.setUp(IntegrationTestBase.java:108)
	at sun.reflect.GeneratedMethodAccessor2.invoke(Unknown Source)
	at sun.reflect.DelegatingMethodAccessorImpl.invoke(DelegatingMethodAccessorImpl.java:43)
(32 more lines...)
Collapse Failed WordCountTest test History
Cloudera Manager Tests - 5.7 1 sec
java.lang.AssertionError: Must have no deployed apps, but found the following apps: groupby-test, purchaseSource, DatasetAccessApp
	at org.junit.Assert.fail(Assert.java:88)
	at org.junit.Assert.assertTrue(Assert.java:41)
	at co.cask.cdap.test.IntegrationTestBase.assertNoApps(IntegrationTestBase.java:424)
	at co.cask.cdap.test.IntegrationTestBase.assertIsClear(IntegrationTestBase.java:382)
	at co.cask.cdap.test.IntegrationTestBase.setUp(IntegrationTestBase.java:108)
	at sun.reflect.GeneratedMethodAccessor2.invoke(Unknown Source)
	at sun.reflect.DelegatingMethodAccessorImpl.invoke(DelegatingMethodAccessorImpl.java:43)
(32 more lines...)
Collapse Failed WorkflowTest testKMeans History
Cloudera Manager Tests - 5.7 1 sec
java.lang.AssertionError: Must have no deployed apps, but found the following apps: groupby-test, purchaseSource, DatasetAccessApp
	at org.junit.Assert.fail(Assert.java:88)
	at org.junit.Assert.assertTrue(Assert.java:41)
	at co.cask.cdap.test.IntegrationTestBase.assertNoApps(IntegrationTestBase.java:424)
	at co.cask.cdap.test.IntegrationTestBase.assertIsClear(IntegrationTestBase.java:382)
	at co.cask.cdap.test.IntegrationTestBase.setUp(IntegrationTestBase.java:108)
	at sun.reflect.GeneratedMethodAccessor2.invoke(Unknown Source)
	at sun.reflect.DelegatingMethodAccessorImpl.invoke(DelegatingMethodAccessorImpl.java:43)
(32 more lines...)
Collapse Failed WorkflowTest testLDA History
Cloudera Manager Tests - 5.7 1 sec
java.lang.AssertionError: Must have no deployed apps, but found the following apps: groupby-test, purchaseSource, DatasetAccessApp
	at org.junit.Assert.fail(Assert.java:88)
	at org.junit.Assert.assertTrue(Assert.java:41)
	at co.cask.cdap.test.IntegrationTestBase.assertNoApps(IntegrationTestBase.java:424)
	at co.cask.cdap.test.IntegrationTestBase.assertIsClear(IntegrationTestBase.java:382)
	at co.cask.cdap.test.IntegrationTestBase.setUp(IntegrationTestBase.java:108)
	at sun.reflect.GeneratedMethodAccessor2.invoke(Unknown Source)
	at sun.reflect.DelegatingMethodAccessorImpl.invoke(DelegatingMethodAccessorImpl.java:43)
(32 more lines...)
Collapse Failed RemoteCubeTest test History
Cloudera Manager Tests - 5.7 1 sec
java.lang.AssertionError: Must have no deployed apps, but found the following apps: groupby-test, purchaseSource, DatasetAccessApp
	at org.junit.Assert.fail(Assert.java:88)
	at org.junit.Assert.assertTrue(Assert.java:41)
	at co.cask.cdap.test.IntegrationTestBase.assertNoApps(IntegrationTestBase.java:424)
	at co.cask.cdap.test.IntegrationTestBase.assertIsClear(IntegrationTestBase.java:382)
	at co.cask.cdap.test.IntegrationTestBase.setUp(IntegrationTestBase.java:108)
	at sun.reflect.GeneratedMethodAccessor2.invoke(Unknown Source)
	at sun.reflect.DelegatingMethodAccessorImpl.invoke(DelegatingMethodAccessorImpl.java:43)
(32 more lines...)
Collapse Failed RemoteKeyValueTest test History
Cloudera Manager Tests - 5.7 1 sec
java.lang.AssertionError: Must have no deployed apps, but found the following apps: groupby-test, purchaseSource, DatasetAccessApp
	at org.junit.Assert.fail(Assert.java:88)
	at org.junit.Assert.assertTrue(Assert.java:41)
	at co.cask.cdap.test.IntegrationTestBase.assertNoApps(IntegrationTestBase.java:424)
	at co.cask.cdap.test.IntegrationTestBase.assertIsClear(IntegrationTestBase.java:382)
	at co.cask.cdap.test.IntegrationTestBase.setUp(IntegrationTestBase.java:108)
	at sun.reflect.GeneratedMethodAccessor2.invoke(Unknown Source)
	at sun.reflect.DelegatingMethodAccessorImpl.invoke(DelegatingMethodAccessorImpl.java:43)
(32 more lines...)
Collapse Failed RemoteTableTest test History
Cloudera Manager Tests - 5.7 1 sec
java.lang.AssertionError: Must have no deployed apps, but found the following apps: groupby-test, purchaseSource, DatasetAccessApp
	at org.junit.Assert.fail(Assert.java:88)
	at org.junit.Assert.assertTrue(Assert.java:41)
	at co.cask.cdap.test.IntegrationTestBase.assertNoApps(IntegrationTestBase.java:424)
	at co.cask.cdap.test.IntegrationTestBase.assertIsClear(IntegrationTestBase.java:382)
	at co.cask.cdap.test.IntegrationTestBase.setUp(IntegrationTestBase.java:108)
	at sun.reflect.GeneratedMethodAccessor2.invoke(Unknown Source)
	at sun.reflect.DelegatingMethodAccessorImpl.invoke(DelegatingMethodAccessorImpl.java:43)
(32 more lines...)