Build #3

Builds and runs unit tests for CDAP Apps repository

Build: #3 failed Changes by Ali Anwar

Stages & jobs

  1. Build Stage

Logs

The following logs have been generated by the jobs in this branch.
  • Expand all
  • Collapse all
Job Logs
Collapse MovieRecommender Build Stage Download or View
26-Aug-2017 04:34:16 [INFO] Building Movie Recommender Application 0.8.0
26-Aug-2017 04:34:16 [INFO] ------------------------------------------------------------------------
26-Aug-2017 04:34:16 [INFO] Downloading: https://oss.sonatype.org/content/repositories/snapshots/co/cask/cdap/cdap-api-spark/4.3.0/cdap-api-spark-4.3.0.pom
26-Aug-2017 04:34:17 [INFO] Downloading: http://scala-tools.org/repo-releases/co/cask/cdap/cdap-api-spark/4.3.0/cdap-api-spark-4.3.0.pom
26-Aug-2017 04:34:17 [INFO] Downloading: http://repo.maven.apache.org/maven2/co/cask/cdap/cdap-api-spark/4.3.0/cdap-api-spark-4.3.0.pom
26-Aug-2017 04:34:19 [INFO] Downloading: https://oss.sonatype.org/content/repositories/snapshots/co/cask/cdap/cdap-api/4.3.0/cdap-api-4.3.0.pom
26-Aug-2017 04:34:19 [INFO] Downloading: http://scala-tools.org/repo-releases/co/cask/cdap/cdap-api/4.3.0/cdap-api-4.3.0.pom
26-Aug-2017 04:34:19 [INFO] Downloading: http://repo.maven.apache.org/maven2/co/cask/cdap/cdap-api/4.3.0/cdap-api-4.3.0.pom
26-Aug-2017 04:34:19 [INFO] Downloading: https://oss.sonatype.org/content/repositories/snapshots/co/cask/cdap/cdap-unit-test/4.3.0/cdap-unit-test-4.3.0.pom
26-Aug-2017 04:34:19 [INFO] Downloading: http://scala-tools.org/repo-releases/co/cask/cdap/cdap-unit-test/4.3.0/cdap-unit-test-4.3.0.pom
26-Aug-2017 04:34:20 [INFO] Downloading: http://repo.maven.apache.org/maven2/co/cask/cdap/cdap-unit-test/4.3.0/cdap-unit-test-4.3.0.pom
26-Aug-2017 04:34:20 [INFO] ------------------------------------------------------------------------
26-Aug-2017 04:34:20 [INFO] BUILD FAILURE
26-Aug-2017 04:34:20 [INFO] ------------------------------------------------------------------------
26-Aug-2017 04:34:20 [INFO] Total time: 5.325s
26-Aug-2017 04:34:20 [INFO] Finished at: Sat Aug 26 04:34:20 UTC 2017
26-Aug-2017 04:34:20 [INFO] Final Memory: 18M/401M
26-Aug-2017 04:34:20 [INFO] ------------------------------------------------------------------------
26-Aug-2017 04:34:20 [ERROR] Failed to execute goal on project MovieRecommender: Could not resolve dependencies for project co.cask.cdap.apps:MovieRecommender:jar:0.8.0: Failed to collect dependencies at co.cask.cdap:cdap-api-spark:jar:4.3.0: Failed to read artifact descriptor for co.cask.cdap:cdap-api-spark:jar:4.3.0: Could not transfer artifact co.cask.cdap:cdap-api-spark:pom:4.3.0 from/to scala-tools.org (http://scala-tools.org/repo-releases): peer not authenticated -> [Help 1]
26-Aug-2017 04:34:20 [ERROR]
26-Aug-2017 04:34:20 [ERROR] To see the full stack trace of the errors, re-run Maven with the -e switch.
26-Aug-2017 04:34:20 [ERROR] Re-run Maven using the -X switch to enable full debug logging.
26-Aug-2017 04:34:20 [ERROR]
26-Aug-2017 04:34:20 [ERROR] For more information about the errors and possible solutions, please read the following articles:
26-Aug-2017 04:34:20 [ERROR] [Help 1] http://cwiki.apache.org/confluence/display/MAVEN/DependencyResolutionException
Collapse Netlens Build Stage Download or View
26-Aug-2017 04:34:14 [WARNING] The POM for co.cask.cdap:cdap-api:jar:4.3.0 is missing, no dependency information available
26-Aug-2017 04:34:14 [INFO] Downloading: https://repository.apache.org/content/repositories/snapshots/co/cask/cdap/cdap-unit-test/4.3.0/cdap-unit-test-4.3.0.pom
26-Aug-2017 04:34:15 [INFO] Downloading: https://oss.sonatype.org/content/repositories/snapshots/co/cask/cdap/cdap-unit-test/4.3.0/cdap-unit-test-4.3.0.pom
26-Aug-2017 04:34:15 [INFO] Downloading: http://repo.maven.apache.org/maven2/co/cask/cdap/cdap-unit-test/4.3.0/cdap-unit-test-4.3.0.pom
26-Aug-2017 04:34:15 [WARNING] The POM for co.cask.cdap:cdap-unit-test:jar:4.3.0 is missing, no dependency information available
26-Aug-2017 04:34:15 [INFO] Downloading: https://repository.apache.org/content/repositories/snapshots/co/cask/cdap/cdap-api/4.3.0/cdap-api-4.3.0.jar
26-Aug-2017 04:34:15 [INFO] Downloading: https://repository.apache.org/content/repositories/snapshots/co/cask/cdap/cdap-unit-test/4.3.0/cdap-unit-test-4.3.0.jar
26-Aug-2017 04:34:15 [INFO] Downloading: https://oss.sonatype.org/content/repositories/snapshots/co/cask/cdap/cdap-api/4.3.0/cdap-api-4.3.0.jar
26-Aug-2017 04:34:15 [INFO] Downloading: https://oss.sonatype.org/content/repositories/snapshots/co/cask/cdap/cdap-unit-test/4.3.0/cdap-unit-test-4.3.0.jar
26-Aug-2017 04:34:15 [INFO] Downloading: http://repo.maven.apache.org/maven2/co/cask/cdap/cdap-api/4.3.0/cdap-api-4.3.0.jar
26-Aug-2017 04:34:15 [INFO] Downloading: http://repo.maven.apache.org/maven2/co/cask/cdap/cdap-unit-test/4.3.0/cdap-unit-test-4.3.0.jar
26-Aug-2017 04:34:15 [INFO] ------------------------------------------------------------------------
26-Aug-2017 04:34:15 [INFO] BUILD FAILURE
26-Aug-2017 04:34:15 [INFO] ------------------------------------------------------------------------
26-Aug-2017 04:34:15 [INFO] Total time: 2.590s
26-Aug-2017 04:34:15 [INFO] Finished at: Sat Aug 26 04:34:15 UTC 2017
26-Aug-2017 04:34:16 [INFO] Final Memory: 11M/224M
26-Aug-2017 04:34:16 [INFO] ------------------------------------------------------------------------
26-Aug-2017 04:34:16 [ERROR] Failed to execute goal on project Netlens: Could not resolve dependencies for project co.cask.cdap.apps:Netlens:jar:0.8.0: The following artifacts could not be resolved: co.cask.cdap:cdap-api:jar:4.3.0, co.cask.cdap:cdap-unit-test:jar:4.3.0: Could not find artifact co.cask.cdap:cdap-api:jar:4.3.0 in apache.snapshots (https://repository.apache.org/content/repositories/snapshots) -> [Help 1]
26-Aug-2017 04:34:16 [ERROR]
26-Aug-2017 04:34:16 [ERROR] To see the full stack trace of the errors, re-run Maven with the -e switch.
26-Aug-2017 04:34:16 [ERROR] Re-run Maven using the -X switch to enable full debug logging.
26-Aug-2017 04:34:16 [ERROR]
26-Aug-2017 04:34:16 [ERROR] For more information about the errors and possible solutions, please read the following articles:
26-Aug-2017 04:34:16 [ERROR] [Help 1] http://cwiki.apache.org/confluence/display/MAVEN/DependencyResolutionException
Collapse TwitterSentiment Build Stage Download or View
26-Aug-2017 04:34:18 [INFO] Downloading: https://repository.apache.org/content/repositories/snapshots/co/cask/cdap/cdap-unit-test/4.3.0/cdap-unit-test-4.3.0.pom
26-Aug-2017 04:34:19 [INFO] Downloading: https://oss.sonatype.org/content/repositories/snapshots/co/cask/cdap/cdap-unit-test/4.3.0/cdap-unit-test-4.3.0.pom
26-Aug-2017 04:34:19 [INFO] Downloading: http://repo.maven.apache.org/maven2/co/cask/cdap/cdap-unit-test/4.3.0/cdap-unit-test-4.3.0.pom
26-Aug-2017 04:34:19 [WARNING] The POM for co.cask.cdap:cdap-unit-test:jar:4.3.0 is missing, no dependency information available
26-Aug-2017 04:34:19 [WARNING] The artifact org.apache.commons:commons-io:jar:1.3.2 has been relocated to commons-io:commons-io:jar:1.3.2
26-Aug-2017 04:34:19 [INFO] Downloading: https://repository.apache.org/content/repositories/snapshots/co/cask/cdap/cdap-api/4.3.0/cdap-api-4.3.0.jar
26-Aug-2017 04:34:19 [INFO] Downloading: https://repository.apache.org/content/repositories/snapshots/co/cask/cdap/cdap-unit-test/4.3.0/cdap-unit-test-4.3.0.jar
26-Aug-2017 04:34:19 [INFO] Downloading: https://oss.sonatype.org/content/repositories/snapshots/co/cask/cdap/cdap-api/4.3.0/cdap-api-4.3.0.jar
26-Aug-2017 04:34:19 [INFO] Downloading: https://oss.sonatype.org/content/repositories/snapshots/co/cask/cdap/cdap-unit-test/4.3.0/cdap-unit-test-4.3.0.jar
26-Aug-2017 04:34:19 [INFO] Downloading: http://repo.maven.apache.org/maven2/co/cask/cdap/cdap-api/4.3.0/cdap-api-4.3.0.jar
26-Aug-2017 04:34:19 [INFO] Downloading: http://repo.maven.apache.org/maven2/co/cask/cdap/cdap-unit-test/4.3.0/cdap-unit-test-4.3.0.jar
26-Aug-2017 04:34:19 [INFO] ------------------------------------------------------------------------
26-Aug-2017 04:34:19 [INFO] BUILD FAILURE
26-Aug-2017 04:34:19 [INFO] ------------------------------------------------------------------------
26-Aug-2017 04:34:19 [INFO] Total time: 5.111s
26-Aug-2017 04:34:19 [INFO] Finished at: Sat Aug 26 04:34:19 UTC 2017
26-Aug-2017 04:34:20 [INFO] Final Memory: 13M/283M
26-Aug-2017 04:34:20 [INFO] ------------------------------------------------------------------------
26-Aug-2017 04:34:20 [ERROR] Failed to execute goal on project TwitterSentiment: Could not resolve dependencies for project co.cask.cdap.apps:TwitterSentiment:jar:0.8.0: The following artifacts could not be resolved: co.cask.cdap:cdap-api:jar:4.3.0, co.cask.cdap:cdap-unit-test:jar:4.3.0: Could not find artifact co.cask.cdap:cdap-api:jar:4.3.0 in apache.snapshots (https://repository.apache.org/content/repositories/snapshots) -> [Help 1]
26-Aug-2017 04:34:20 [ERROR]
26-Aug-2017 04:34:20 [ERROR] To see the full stack trace of the errors, re-run Maven with the -e switch.
26-Aug-2017 04:34:20 [ERROR] Re-run Maven using the -X switch to enable full debug logging.
26-Aug-2017 04:34:20 [ERROR]
26-Aug-2017 04:34:20 [ERROR] For more information about the errors and possible solutions, please read the following articles:
26-Aug-2017 04:34:20 [ERROR] [Help 1] http://cwiki.apache.org/confluence/display/MAVEN/DependencyResolutionException
Collapse Wise Build Stage Download or View
26-Aug-2017 04:34:57 [INFO] Downloading: https://oss.sonatype.org/content/repositories/snapshots/org/apache/hadoop/hadoop-auth/2.1.2-SNAPSHOT/maven-metadata.xml
26-Aug-2017 04:34:57 [INFO] Downloading: https://repository.apache.org/content/repositories/snapshots/org/apache/hadoop/hadoop-auth/2.1.2-SNAPSHOT/maven-metadata.xml
26-Aug-2017 04:34:57 [INFO] Downloading: https://repository.apache.org/content/repositories/snapshots/org/apache/hadoop/hadoop-auth/2.1.2-SNAPSHOT/maven-metadata.xml
26-Aug-2017 04:34:57 [INFO] Downloaded: https://repository.apache.org/content/repositories/snapshots/org/apache/hadoop/hadoop-auth/2.1.2-SNAPSHOT/maven-metadata.xml (996 B at 3.7 KB/sec)
26-Aug-2017 04:34:57 [INFO] Downloaded: https://repository.apache.org/content/repositories/snapshots/org/apache/hadoop/hadoop-auth/2.1.2-SNAPSHOT/maven-metadata.xml (996 B at 3.7 KB/sec)
26-Aug-2017 04:34:57 [INFO] Downloading: https://repository.apache.org/content/repositories/snapshots/co/cask/cdap/cdap-api/4.3.0/cdap-api-4.3.0.jar
26-Aug-2017 04:34:57 [INFO] Downloading: https://repository.apache.org/content/repositories/snapshots/co/cask/cdap/cdap-unit-test/4.3.0/cdap-unit-test-4.3.0.jar
26-Aug-2017 04:34:58 [INFO] Downloading: https://oss.sonatype.org/content/repositories/snapshots/co/cask/cdap/cdap-api/4.3.0/cdap-api-4.3.0.jar
26-Aug-2017 04:34:58 [INFO] Downloading: https://oss.sonatype.org/content/repositories/snapshots/co/cask/cdap/cdap-unit-test/4.3.0/cdap-unit-test-4.3.0.jar
26-Aug-2017 04:34:58 [INFO] Downloading: http://repo.maven.apache.org/maven2/co/cask/cdap/cdap-api/4.3.0/cdap-api-4.3.0.jar
26-Aug-2017 04:34:58 [INFO] Downloading: http://repo.maven.apache.org/maven2/co/cask/cdap/cdap-unit-test/4.3.0/cdap-unit-test-4.3.0.jar
26-Aug-2017 04:34:58 [INFO] ------------------------------------------------------------------------
26-Aug-2017 04:34:58 [INFO] BUILD FAILURE
26-Aug-2017 04:34:58 [INFO] ------------------------------------------------------------------------
26-Aug-2017 04:34:58 [INFO] Total time: 43.670s
26-Aug-2017 04:34:58 [INFO] Finished at: Sat Aug 26 04:34:58 UTC 2017
26-Aug-2017 04:34:58 [INFO] Final Memory: 23M/219M
26-Aug-2017 04:34:58 [INFO] ------------------------------------------------------------------------
26-Aug-2017 04:34:58 [ERROR] Failed to execute goal on project cdap-wise: Could not resolve dependencies for project co.cask.cdap.apps:cdap-wise:jar:0.8.0: The following artifacts could not be resolved: co.cask.cdap:cdap-api:jar:4.3.0, co.cask.cdap:cdap-unit-test:jar:4.3.0: Could not find artifact co.cask.cdap:cdap-api:jar:4.3.0 in apache.snapshots (https://repository.apache.org/content/repositories/snapshots) -> [Help 1]
26-Aug-2017 04:34:58 [ERROR]
26-Aug-2017 04:34:58 [ERROR] To see the full stack trace of the errors, re-run Maven with the -e switch.
26-Aug-2017 04:34:58 [ERROR] Re-run Maven using the -X switch to enable full debug logging.
26-Aug-2017 04:34:58 [ERROR]
26-Aug-2017 04:34:58 [ERROR] For more information about the errors and possible solutions, please read the following articles:
26-Aug-2017 04:34:58 [ERROR] [Help 1] http://cwiki.apache.org/confluence/display/MAVEN/DependencyResolutionException