Build #50

Builds and runs unit tests for CDAP Apps repository

Build: #50 failed

Job: Wise failed

Stages & jobs

  1. Build Stage

Build log

The build generated 70 lines of output. Download or view full build log

09-Apr-2017 02:00:00 Build CDAP Apps - Build and Unit Test - release-cdap-2.8-compatible - Wise #50 (CA-BUT0-WISE-50) started building on agent bamboo-agent06.prod.continuuity.net
09-Apr-2017 02:00:00 Remote Agent
09-Apr-2017 02:00:00 Build working directory is /var/bamboo/xml-data/build-dir/CA-BUT0-WISE
09-Apr-2017 02:00:01 Executing build CDAP Apps - Build and Unit Test - release-cdap-2.8-compatible - Wise #50 (CA-BUT0-WISE-50)
09-Apr-2017 02:00:01 Starting task 'Checkout Default Repository' of type 'com.atlassian.bamboo.plugins.vcs:task.vcs.checkout'
09-Apr-2017 02:00:01 Build always requires a clean checkout
09-Apr-2017 02:00:01 Cleaning build directory '/var/bamboo/xml-data/build-dir/CA-BUT0-WISE'
09-Apr-2017 02:00:01 Updating source code to revision: bf1b0519a671b922f4df01a7041d0af77f65b4bf
09-Apr-2017 02:00:01 Fetching 'refs/heads/release/cdap-2.8-compatible' from 'https://github.com/caskdata/cdap-apps.git'.
09-Apr-2017 02:00:02 Checking out revision bf1b0519a671b922f4df01a7041d0af77f65b4bf.
09-Apr-2017 02:00:02 Creating local git repository in '/var/bamboo/xml-data/build-dir/CA-BUT0-WISE/.git'.
09-Apr-2017 02:00:02 Cloning into '/var/bamboo/xml-data/build-dir/CA-BUT0-WISE'...
09-Apr-2017 02:00:02 done.
09-Apr-2017 02:00:02 Switched to a new branch 'release/cdap-2.8-compatible'
09-Apr-2017 02:00:02 Branch release/cdap-2.8-compatible set up to track remote branch release/cdap-2.8-compatible from origin.
09-Apr-2017 02:00:02 Updated source code to revision: bf1b0519a671b922f4df01a7041d0af77f65b4bf
09-Apr-2017 02:00:02 Finished task 'Checkout Default Repository' with result: Success
09-Apr-2017 02:00:02 Running pre-build action: VCS Version Collector
09-Apr-2017 02:00:02 Running pre-build action: Hung Build Killer PreBuildAction
09-Apr-2017 02:00:02 Starting task 'Wise' of type 'com.atlassian.bamboo.plugins.maven:task.builder.mvn3'
09-Apr-2017 02:00:02
Beginning to execute external process for build 'CDAP Apps - Build and Unit Test - release-cdap-2.8-compatible - Wise #50 (CA-BUT0-WISE-50)'
... running command line:
/opt/maven/bin/mvn --batch-mode -Djava.io.tmpdir=/tmp/CA-BUT0-WISE clean package
... in: /var/bamboo/xml-data/build-dir/CA-BUT0-WISE/Wise
... using extra environment variables:
bamboo_planRepository_1_branch=release/cdap-2.8-compatible
bamboo_repository_41353651_name=CDAP Apps
bamboo_docs_upload_host=docs1.cask.co
bamboo_planRepository_1_branchDisplayName=release/cdap-2.8-compatible
bamboo_repository_revision_number=bf1b0519a671b922f4df01a7041d0af77f65b4bf
MAVEN2_HOME=/opt/maven
bamboo_docs_s3_bucket=docs.cask.co
bamboo_capability_system_builder_command_s3cmd=/usr/bin/s3cmd
bamboo_buildKey=CA-BUT0-WISE
bamboo_gpg_password=********
bamboo_ops_gpg_password=********
bamboo_shortJobName=Wise
bamboo_buildResultsUrl=http://builds.cask.co/browse/CA-BUT0-WISE-50
bamboo_repository_s3_bucket=repository.cask.co
bamboo_planRepository_repositoryUrl=https://github.com/caskdata/cdap-apps.git
bamboo_capability_system_builder_mvn3_Maven_3_1=/opt/maven
bamboo_aws_secret_access_key_password=********
bamboo_agentId=32243718
bamboo_capability_Swapfile=true
bamboo_planRepository_revision=bf1b0519a671b922f4df01a7041d0af77f65b4bf
bamboo_remote_docs_base=/var/www/docs
bamboo_planRepository_previousRevision=bf1b0519a671b922f4df01a7041d0af77f65b4bf
bamboo_capability_RHEL=rhel
bamboo_capability_freight=true
bamboo_repository_branch_name=release/cdap-2.8-compatible
bamboo_docs_upload_user=bamboo
bamboo_kdc_address_password=********
bamboo_capability_GPG=GPG
bamboo_capability_system_jdk_Oracle_JDK_8=/usr/lib/jvm/jdk8
JAVA_HOME=/usr/lib/jvm/jdk1.7.0_75
bamboo_capability_system_jdk_Oracle_JDK_7=/usr/lib/jvm/jdk7
bamboo_repository_41353651_revision_number=bf1b0519a671b922f4df01a7041d0af77f65b4bf
bamboo_downloads_s3_bucket=downloads.cask.co
bamboo_planRepository_branch=release/cdap-2.8-compatible
bamboo_docs_server_list=docs1.cask.co,docs2.cask.co
bamboo_market_s3_access_key_password=********
bamboo_planRepository_1_type=gitv2
bamboo_planRepository_branchName=release/cdap-2.8-compatible
bamboo_capability_SPHINX=Sphinx
bamboo_capability_rsync=true
bamboo_market_cloudfront_secret_key_password=********
bamboo_capability_system_jdk_JDK=/usr/lib/jvm/jdk1.7.0_75
bamboo_planRepository_type=gitv2
bamboo_planRepository_1_username=
bamboo_capability_expect=true
bamboo_capability_RSYNC=rsync
useMavenReturnCode=false
bamboo_capability_system_builder_node_Node_js=/usr/bin/node
bamboo_docs_upload_target=/data/s3stg/incoming
bamboo_capability_system_builder_mvn3_Maven_3=/opt/maven
bamboo_planKey=CA-BUT0
bamboo_planRepository_username=
bamboo_planRepository_1_branchName=release/cdap-2.8-compatible
bamboo_capability_s3cmd=true
bamboo_repository_41353651_git_branch=release/cdap-2.8-compatible
bamboo_resultsUrl=http://builds.cask.co/browse/CA-BUT0-WISE-50
bamboo_capability_Sphinx=true
bamboo_repository_41353651_branch_name=release/cdap-2.8-compatible
bamboo_repository_41353651_previous_revision_number=bf1b0519a671b922f4df01a7041d0af77f65b4bf
bamboo_planRepository_1_name=CDAP Apps
bamboo_build_working_directory=/var/bamboo/xml-data/build-dir/CA-BUT0-WISE
bamboo_shortPlanName=release-cdap-2.8-compatible
bamboo_planRepository_name=CDAP Apps
bamboo_capability_git_lfs=true
bamboo_buildNumber=50
bamboo_docs_server1=docs1.cask.co
bamboo_planName=CDAP Apps - Build and Unit Test - release-cdap-2.8-compatible
bamboo_shortPlanKey=BUT0
bamboo_docs_server2=docs2.cask.co
bamboo_shortJobKey=WISE
bamboo_repository_previous_revision_number=bf1b0519a671b922f4df01a7041d0af77f65b4bf
bamboo_buildTimeStamp=2017-04-09T02:00:00.771Z
M2_HOME=/opt/maven
bamboo_s3_bucket=repository.cask.co
bamboo_buildResultKey=CA-BUT0-WISE-50
bamboo_capability_system_builder_command_Docker=/usr/bin/docker
bamboo_repository_git_branch=release/cdap-2.8-compatible
bamboo_market_s3_secret_key_password=********
bamboo_buildPlanName=CDAP Apps - Build and Unit Test - release-cdap-2.8-compatible - Wise
bamboo_capability_system_builder_command_fpm=/opt/rbenv/shims/fpm
bamboo_capability_system_jdk_JDK_1_8_0_101=/usr/lib/jvm/jdk1.8.0_101
bamboo_repository_41353651_git_repositoryUrl=https://github.com/caskdata/cdap-apps.git
bamboo_planRepository_1_revision=bf1b0519a671b922f4df01a7041d0af77f65b4bf
bamboo_capability_Platform=rhel
bamboo_repository_name=CDAP Apps
bamboo_capability_system_docker_executable=/usr/bin/docker
MAVEN_OPTS=-Xmx2048m
bamboo_agentWorkingDirectory=/var/bamboo/xml-data/build-dir
bamboo_capability_system_git_executable=/usr/local/bin/git
bamboo_planRepository_1_previousRevision=bf1b0519a671b922f4df01a7041d0af77f65b4bf
bamboo_repository_git_username=
bamboo_capability_system_builder_command_Ruby=/opt/rbenv/shims/ruby
bamboo_planRepository_branchDisplayName=release/cdap-2.8-compatible
bamboo_aws_access_key_password=********
bamboo_capability_system_builder_mvn3_Maven_3_x=/opt/maven
bamboo_plan_storageTag=CA-BUT0
bamboo_repository_git_repositoryUrl=https://github.com/caskdata/cdap-apps.git
bamboo_market_cloudfront_access_key_password=********
bamboo_working_directory=/var/bamboo/xml-data/build-dir/CA-BUT0-WISE
bamboo_planRepository_1_repositoryUrl=https://github.com/caskdata/cdap-apps.git
bamboo_capability_createrepo=true
bamboo_capability_system_jdk_JDK_1_8=/usr/lib/jvm/jdk1.8.0_101
bamboo_capability_rpm_build=true
bamboo_capability_system_jdk_JDK_1_7=/usr/lib/jvm/jdk1.7.0_75
bamboo_repository_41353651_git_username=
PATH=/usr/lib/jvm/jdk1.7.0_75/bin:/usr/lib/jvm/java/bin:/opt/rbenv/shims:/opt/rbenv/bin:/opt/rbenv/plugins/ruby_build/bin:/usr/local/maven-3.1.1/bin:/usr/local/bin:/bin:/usr/bin:/usr/local/sbin:/usr/sbin:/sbin:/home/bamboo/bin
09-Apr-2017 02:00:04 [INFO] Scanning for projects...
09-Apr-2017 02:00:05 [INFO]                                                                         
09-Apr-2017 02:00:05 [INFO] ------------------------------------------------------------------------
09-Apr-2017 02:00:05 [INFO] Building Web Insights Engine Application 0.3.0
09-Apr-2017 02:00:05 [INFO] ------------------------------------------------------------------------
09-Apr-2017 02:00:06 [INFO] Downloading: http://oss.sonatype.org/content/groups/public/org/apache/hbase/hbase/0.94.6.1.continuuity/hbase-0.94.6.1.continuuity.pom
09-Apr-2017 02:00:08 [INFO] Downloading: http://oss.sonatype.org/content/repositories/snapshots/org/apache/hbase/hbase/0.94.6.1.continuuity/hbase-0.94.6.1.continuuity.pom
09-Apr-2017 02:00:08 [INFO] Downloading: https://repository.continuuity.com/content/repositories/public/org/apache/hbase/hbase/0.94.6.1.continuuity/hbase-0.94.6.1.continuuity.pom
09-Apr-2017 02:00:09 [INFO] Downloading: http://oss.sonatype.org/content/groups/public/org/apache/hadoop/hadoop-mapreduce-client-app/maven-metadata.xml
09-Apr-2017 02:00:09 [INFO] Downloading: http://oss.sonatype.org/content/repositories/snapshots/org/apache/hadoop/hadoop-mapreduce-client-app/maven-metadata.xml
09-Apr-2017 02:00:10 [INFO] Downloading: http://oss.sonatype.org/content/groups/public/org/apache/hadoop/hadoop-mapreduce-client-core/maven-metadata.xml
09-Apr-2017 02:00:10 [INFO] Downloading: http://oss.sonatype.org/content/repositories/snapshots/org/apache/hadoop/hadoop-mapreduce-client-core/maven-metadata.xml
09-Apr-2017 02:00:10 [INFO] Downloading: http://oss.sonatype.org/content/groups/public/org/apache/hadoop/hadoop-common/maven-metadata.xml
09-Apr-2017 02:00:10 [INFO] Downloading: http://oss.sonatype.org/content/repositories/snapshots/org/apache/hadoop/hadoop-common/maven-metadata.xml
09-Apr-2017 02:00:11 [INFO] ------------------------------------------------------------------------
09-Apr-2017 02:00:11 [INFO] BUILD FAILURE
09-Apr-2017 02:00:11 [INFO] ------------------------------------------------------------------------
09-Apr-2017 02:00:11 [INFO] Total time: 6.741s
09-Apr-2017 02:00:11 [INFO] Finished at: Sun Apr 09 02:00:11 UTC 2017
09-Apr-2017 02:00:11 [INFO] Final Memory: 27M/401M
09-Apr-2017 02:00:11 [INFO] ------------------------------------------------------------------------
09-Apr-2017 02:00:11 [ERROR] Failed to execute goal on project cdap-wise: Could not resolve dependencies for project co.cask.cdap.apps:cdap-wise:jar:0.3.0: Failed to collect dependencies at co.cask.cdap:cdap-unit-test:jar:2.8.0 -> co.cask.cdap:cdap-notifications:jar:2.8.0 -> co.cask.cdap:cdap-data-fabric:jar:2.8.0 -> org.apache.hbase:hbase:jar:0.94.6.1.continuuity: Failed to read artifact descriptor for org.apache.hbase:hbase:jar:0.94.6.1.continuuity: Could not transfer artifact org.apache.hbase:hbase:pom:0.94.6.1.continuuity from/to continuuity-public (https://repository.continuuity.com/content/repositories/public): repository.continuuity.com: Name or service not known: Unknown host repository.continuuity.com: Name or service not known -> [Help 1]
09-Apr-2017 02:00:11 [ERROR]
09-Apr-2017 02:00:11 [ERROR] To see the full stack trace of the errors, re-run Maven with the -e switch.
09-Apr-2017 02:00:11 [ERROR] Re-run Maven using the -X switch to enable full debug logging.
09-Apr-2017 02:00:11 [ERROR]
09-Apr-2017 02:00:11 [ERROR] For more information about the errors and possible solutions, please read the following articles:
09-Apr-2017 02:00:11 [ERROR] [Help 1] http://cwiki.apache.org/confluence/display/MAVEN/DependencyResolutionException
09-Apr-2017 02:00:11 Failing task since return code of [/opt/maven/bin/mvn --batch-mode -Djava.io.tmpdir=/tmp/CA-BUT0-WISE clean package] was 1 while expected 0
09-Apr-2017 02:00:11 Parsing test results under /var/bamboo/xml-data/build-dir/CA-BUT0-WISE...
09-Apr-2017 02:00:11 Finished task 'Wise' with result: Failed
09-Apr-2017 02:00:11 Running post build plugin 'Docker Container Cleanup'
09-Apr-2017 02:00:11 Running post build plugin 'NCover Results Collector'
09-Apr-2017 02:00:11 Running post build plugin 'Clover Results Collector'
09-Apr-2017 02:00:11 Running post build plugin 'npm Cache Cleanup'
09-Apr-2017 02:00:11 Running post build plugin 'Artifact Copier'
09-Apr-2017 02:00:11 Finalising the build...
09-Apr-2017 02:00:11 Stopping timer.
09-Apr-2017 02:00:11 Build CA-BUT0-WISE-50 completed.
09-Apr-2017 02:00:11 Running on server: post build plugin 'NCover Results Collector'
09-Apr-2017 02:00:11 Running on server: post build plugin 'Build Hanging Detection Configuration'
09-Apr-2017 02:00:11 Running on server: post build plugin 'Clover Delta Calculator'
09-Apr-2017 02:00:11 Running on server: post build plugin 'Maven Dependencies Postprocessor'
09-Apr-2017 02:00:11 All post build plugins have finished
09-Apr-2017 02:00:11 Generating build results summary...
09-Apr-2017 02:00:11 Saving build results to disk...
09-Apr-2017 02:00:11 Logging substituted variables...
09-Apr-2017 02:00:11 Indexing build results...
09-Apr-2017 02:00:12 Finished building CA-BUT0-WISE-50.