Build #50

Builds and runs unit tests for CDAP Apps repository

Build: #50 failed Scheduled

Stages & jobs

  1. Build Stage

Logs

The following logs have been generated by the jobs in this branch.
  • Expand all
  • Collapse all
Job Logs
Collapse MovieRecommender Build Stage Download or View
09-Apr-2017 02:00:05 [INFO] Scanning for projects...
09-Apr-2017 02:00:06 [INFO]                                                                         
09-Apr-2017 02:00:06 [INFO] ------------------------------------------------------------------------
09-Apr-2017 02:00:06 [INFO] Building Movie Recommender Application 0.3.0
09-Apr-2017 02:00:06 [INFO] ------------------------------------------------------------------------
09-Apr-2017 02:00:08 [INFO] Downloading: http://oss.sonatype.org/content/groups/public/org/apache/hbase/hbase/0.94.6.1.continuuity/hbase-0.94.6.1.continuuity.pom
09-Apr-2017 02:00:09 [INFO] Downloading: http://oss.sonatype.org/content/repositories/snapshots/org/apache/hbase/hbase/0.94.6.1.continuuity/hbase-0.94.6.1.continuuity.pom
09-Apr-2017 02:00:09 [INFO] Downloading: http://scala-tools.org/repo-releases/org/apache/hbase/hbase/0.94.6.1.continuuity/hbase-0.94.6.1.continuuity.pom
09-Apr-2017 02:00:09 [INFO] Downloading: http://repo.maven.apache.org/maven2/org/apache/hbase/hbase/0.94.6.1.continuuity/hbase-0.94.6.1.continuuity.pom
09-Apr-2017 02:00:09 [INFO] Downloading: https://oss.sonatype.org/content/repositories/snapshots/org/apache/hbase/hbase/0.94.6.1.continuuity/hbase-0.94.6.1.continuuity.pom
09-Apr-2017 02:00:09 [INFO] Downloading: https://repository.continuuity.com/content/repositories/public/org/apache/hbase/hbase/0.94.6.1.continuuity/hbase-0.94.6.1.continuuity.pom
09-Apr-2017 02:00:11 [INFO] ------------------------------------------------------------------------
09-Apr-2017 02:00:11 [INFO] BUILD FAILURE
09-Apr-2017 02:00:11 [INFO] ------------------------------------------------------------------------
09-Apr-2017 02:00:11 [INFO] Total time: 5.823s
09-Apr-2017 02:00:11 [INFO] Finished at: Sun Apr 09 02:00:11 UTC 2017
09-Apr-2017 02:00:11 [INFO] Final Memory: 18M/283M
09-Apr-2017 02:00:11 [INFO] ------------------------------------------------------------------------
09-Apr-2017 02:00:11 [ERROR] Failed to execute goal on project MovieRecommender: Could not resolve dependencies for project co.cask.cdap.apps:MovieRecommender:jar:0.3.0: Failed to collect dependencies at co.cask.cdap:cdap-unit-test:jar:2.8.0 -> co.cask.cdap:cdap-notifications:jar:2.8.0 -> co.cask.cdap:cdap-data-fabric:jar:2.8.0 -> org.apache.hbase:hbase:jar:0.94.6.1.continuuity: Failed to read artifact descriptor for org.apache.hbase:hbase:jar:0.94.6.1.continuuity: Could not transfer artifact org.apache.hbase:hbase:pom:0.94.6.1.continuuity from/to scala-tools.org (http://scala-tools.org/repo-releases): peer not authenticated -> [Help 1]
09-Apr-2017 02:00:11 [ERROR]
09-Apr-2017 02:00:11 [ERROR] To see the full stack trace of the errors, re-run Maven with the -e switch.
09-Apr-2017 02:00:11 [ERROR] Re-run Maven using the -X switch to enable full debug logging.
09-Apr-2017 02:00:11 [ERROR]
09-Apr-2017 02:00:11 [ERROR] For more information about the errors and possible solutions, please read the following articles:
09-Apr-2017 02:00:11 [ERROR] [Help 1] http://cwiki.apache.org/confluence/display/MAVEN/DependencyResolutionException
Collapse Netlens Build Stage Download or View
09-Apr-2017 02:00:05 [INFO] Scanning for projects...
09-Apr-2017 02:00:05 [INFO]                                                                         
09-Apr-2017 02:00:05 [INFO] ------------------------------------------------------------------------
09-Apr-2017 02:00:05 [INFO] Building Netlens Application 0.3.0
09-Apr-2017 02:00:05 [INFO] ------------------------------------------------------------------------
09-Apr-2017 02:00:07 [INFO] Downloading: https://repository.apache.org/content/repositories/snapshots/org/apache/hbase/hbase/0.94.6.1.continuuity/hbase-0.94.6.1.continuuity.pom
09-Apr-2017 02:00:07 [INFO] Downloading: https://oss.sonatype.org/content/groups/public/org/apache/hbase/hbase/0.94.6.1.continuuity/hbase-0.94.6.1.continuuity.pom
09-Apr-2017 02:00:08 [INFO] Downloading: https://oss.sonatype.org/content/repositories/snapshots/org/apache/hbase/hbase/0.94.6.1.continuuity/hbase-0.94.6.1.continuuity.pom
09-Apr-2017 02:00:08 [INFO] Downloading: http://repo.maven.apache.org/maven2/org/apache/hbase/hbase/0.94.6.1.continuuity/hbase-0.94.6.1.continuuity.pom
09-Apr-2017 02:00:08 [INFO] Downloading: https://repository.continuuity.com/content/repositories/public/org/apache/hbase/hbase/0.94.6.1.continuuity/hbase-0.94.6.1.continuuity.pom
09-Apr-2017 02:00:11 [INFO] ------------------------------------------------------------------------
09-Apr-2017 02:00:11 [INFO] BUILD FAILURE
09-Apr-2017 02:00:11 [INFO] ------------------------------------------------------------------------
09-Apr-2017 02:00:11 [INFO] Total time: 6.235s
09-Apr-2017 02:00:11 [INFO] Finished at: Sun Apr 09 02:00:11 UTC 2017
09-Apr-2017 02:00:11 [INFO] Final Memory: 18M/401M
09-Apr-2017 02:00:11 [INFO] ------------------------------------------------------------------------
09-Apr-2017 02:00:11 [ERROR] Failed to execute goal on project Netlens: Could not resolve dependencies for project co.cask.cdap.apps:Netlens:jar:0.3.0: Failed to collect dependencies at co.cask.cdap:cdap-unit-test:jar:2.8.0 -> co.cask.cdap:cdap-notifications:jar:2.8.0 -> co.cask.cdap:cdap-data-fabric:jar:2.8.0 -> org.apache.hbase:hbase:jar:0.94.6.1.continuuity: Failed to read artifact descriptor for org.apache.hbase:hbase:jar:0.94.6.1.continuuity: Could not transfer artifact org.apache.hbase:hbase:pom:0.94.6.1.continuuity from/to continuuity-public (https://repository.continuuity.com/content/repositories/public): repository.continuuity.com: Name or service not known: Unknown host repository.continuuity.com: Name or service not known -> [Help 1]
09-Apr-2017 02:00:11 [ERROR]
09-Apr-2017 02:00:11 [ERROR] To see the full stack trace of the errors, re-run Maven with the -e switch.
09-Apr-2017 02:00:11 [ERROR] Re-run Maven using the -X switch to enable full debug logging.
09-Apr-2017 02:00:11 [ERROR]
09-Apr-2017 02:00:11 [ERROR] For more information about the errors and possible solutions, please read the following articles:
09-Apr-2017 02:00:11 [ERROR] [Help 1] http://cwiki.apache.org/confluence/display/MAVEN/DependencyResolutionException
Collapse TwitterSentiment Build Stage Download or View
09-Apr-2017 02:00:09 [INFO] Downloading: http://oss.sonatype.org/content/repositories/snapshots/org/twitter4j/twitter4j-stream/maven-metadata.xml
09-Apr-2017 02:00:09 [INFO] Downloaded: http://repo.maven.apache.org/maven2/org/twitter4j/twitter4j-stream/maven-metadata.xml (925 B at 29.1 KB/sec)
09-Apr-2017 02:00:10 [INFO] Downloaded: http://oss.sonatype.org/content/groups/public/org/twitter4j/twitter4j-stream/maven-metadata.xml (925 B at 2.9 KB/sec)
09-Apr-2017 02:00:10 [INFO] Downloading: http://oss.sonatype.org/content/repositories/snapshots/org/twitter4j/twitter4j-media-support/maven-metadata.xml
09-Apr-2017 02:00:10 [INFO] Downloading: http://oss.sonatype.org/content/groups/public/org/twitter4j/twitter4j-media-support/maven-metadata.xml
09-Apr-2017 02:00:10 [INFO] Downloading: http://repo.maven.apache.org/maven2/org/twitter4j/twitter4j-media-support/maven-metadata.xml
09-Apr-2017 02:00:10 [INFO] Downloaded: http://repo.maven.apache.org/maven2/org/twitter4j/twitter4j-media-support/maven-metadata.xml (2 KB at 35.5 KB/sec)
09-Apr-2017 02:00:10 [INFO] Downloaded: http://oss.sonatype.org/content/groups/public/org/twitter4j/twitter4j-media-support/maven-metadata.xml (2 KB at 3.1 KB/sec)
09-Apr-2017 02:00:11 [INFO] Downloading: http://oss.sonatype.org/content/groups/public/org/apache/hbase/hbase/0.94.6.1.continuuity/hbase-0.94.6.1.continuuity.pom
09-Apr-2017 02:00:14 [INFO] Downloading: http://oss.sonatype.org/content/repositories/snapshots/org/apache/hbase/hbase/0.94.6.1.continuuity/hbase-0.94.6.1.continuuity.pom
09-Apr-2017 02:00:15 [INFO] Downloading: https://repository.continuuity.com/content/repositories/public/org/apache/hbase/hbase/0.94.6.1.continuuity/hbase-0.94.6.1.continuuity.pom
09-Apr-2017 02:00:15 [INFO] ------------------------------------------------------------------------
09-Apr-2017 02:00:15 [INFO] BUILD FAILURE
09-Apr-2017 02:00:15 [INFO] ------------------------------------------------------------------------
09-Apr-2017 02:00:15 [INFO] Total time: 11.054s
09-Apr-2017 02:00:15 [INFO] Finished at: Sun Apr 09 02:00:15 UTC 2017
09-Apr-2017 02:00:15 [INFO] Final Memory: 17M/283M
09-Apr-2017 02:00:15 [INFO] ------------------------------------------------------------------------
09-Apr-2017 02:00:15 [ERROR] Failed to execute goal on project TwitterSentiment: Could not resolve dependencies for project co.cask.cdap.apps:TwitterSentiment:jar:0.3.0: Failed to collect dependencies at co.cask.cdap:cdap-unit-test:jar:2.8.0 -> co.cask.cdap:cdap-notifications:jar:2.8.0 -> co.cask.cdap:cdap-data-fabric:jar:2.8.0 -> org.apache.hbase:hbase:jar:0.94.6.1.continuuity: Failed to read artifact descriptor for org.apache.hbase:hbase:jar:0.94.6.1.continuuity: Could not transfer artifact org.apache.hbase:hbase:pom:0.94.6.1.continuuity from/to continuuity-public (https://repository.continuuity.com/content/repositories/public): repository.continuuity.com: Name or service not known: Unknown host repository.continuuity.com: Name or service not known -> [Help 1]
09-Apr-2017 02:00:15 [ERROR]
09-Apr-2017 02:00:15 [ERROR] To see the full stack trace of the errors, re-run Maven with the -e switch.
09-Apr-2017 02:00:15 [ERROR] Re-run Maven using the -X switch to enable full debug logging.
09-Apr-2017 02:00:15 [ERROR]
09-Apr-2017 02:00:15 [ERROR] For more information about the errors and possible solutions, please read the following articles:
09-Apr-2017 02:00:15 [ERROR] [Help 1] http://cwiki.apache.org/confluence/display/MAVEN/DependencyResolutionException
Collapse Wise Build Stage Download or View
09-Apr-2017 02:00:05 [INFO] Building Web Insights Engine Application 0.3.0
09-Apr-2017 02:00:05 [INFO] ------------------------------------------------------------------------
09-Apr-2017 02:00:06 [INFO] Downloading: http://oss.sonatype.org/content/groups/public/org/apache/hbase/hbase/0.94.6.1.continuuity/hbase-0.94.6.1.continuuity.pom
09-Apr-2017 02:00:08 [INFO] Downloading: http://oss.sonatype.org/content/repositories/snapshots/org/apache/hbase/hbase/0.94.6.1.continuuity/hbase-0.94.6.1.continuuity.pom
09-Apr-2017 02:00:08 [INFO] Downloading: https://repository.continuuity.com/content/repositories/public/org/apache/hbase/hbase/0.94.6.1.continuuity/hbase-0.94.6.1.continuuity.pom
09-Apr-2017 02:00:09 [INFO] Downloading: http://oss.sonatype.org/content/groups/public/org/apache/hadoop/hadoop-mapreduce-client-app/maven-metadata.xml
09-Apr-2017 02:00:09 [INFO] Downloading: http://oss.sonatype.org/content/repositories/snapshots/org/apache/hadoop/hadoop-mapreduce-client-app/maven-metadata.xml
09-Apr-2017 02:00:10 [INFO] Downloading: http://oss.sonatype.org/content/groups/public/org/apache/hadoop/hadoop-mapreduce-client-core/maven-metadata.xml
09-Apr-2017 02:00:10 [INFO] Downloading: http://oss.sonatype.org/content/repositories/snapshots/org/apache/hadoop/hadoop-mapreduce-client-core/maven-metadata.xml
09-Apr-2017 02:00:10 [INFO] Downloading: http://oss.sonatype.org/content/groups/public/org/apache/hadoop/hadoop-common/maven-metadata.xml
09-Apr-2017 02:00:10 [INFO] Downloading: http://oss.sonatype.org/content/repositories/snapshots/org/apache/hadoop/hadoop-common/maven-metadata.xml
09-Apr-2017 02:00:11 [INFO] ------------------------------------------------------------------------
09-Apr-2017 02:00:11 [INFO] BUILD FAILURE
09-Apr-2017 02:00:11 [INFO] ------------------------------------------------------------------------
09-Apr-2017 02:00:11 [INFO] Total time: 6.741s
09-Apr-2017 02:00:11 [INFO] Finished at: Sun Apr 09 02:00:11 UTC 2017
09-Apr-2017 02:00:11 [INFO] Final Memory: 27M/401M
09-Apr-2017 02:00:11 [INFO] ------------------------------------------------------------------------
09-Apr-2017 02:00:11 [ERROR] Failed to execute goal on project cdap-wise: Could not resolve dependencies for project co.cask.cdap.apps:cdap-wise:jar:0.3.0: Failed to collect dependencies at co.cask.cdap:cdap-unit-test:jar:2.8.0 -> co.cask.cdap:cdap-notifications:jar:2.8.0 -> co.cask.cdap:cdap-data-fabric:jar:2.8.0 -> org.apache.hbase:hbase:jar:0.94.6.1.continuuity: Failed to read artifact descriptor for org.apache.hbase:hbase:jar:0.94.6.1.continuuity: Could not transfer artifact org.apache.hbase:hbase:pom:0.94.6.1.continuuity from/to continuuity-public (https://repository.continuuity.com/content/repositories/public): repository.continuuity.com: Name or service not known: Unknown host repository.continuuity.com: Name or service not known -> [Help 1]
09-Apr-2017 02:00:11 [ERROR]
09-Apr-2017 02:00:11 [ERROR] To see the full stack trace of the errors, re-run Maven with the -e switch.
09-Apr-2017 02:00:11 [ERROR] Re-run Maven using the -X switch to enable full debug logging.
09-Apr-2017 02:00:11 [ERROR]
09-Apr-2017 02:00:11 [ERROR] For more information about the errors and possible solutions, please read the following articles:
09-Apr-2017 02:00:11 [ERROR] [Help 1] http://cwiki.apache.org/confluence/display/MAVEN/DependencyResolutionException