Build #69

Builds and runs unit tests for CDAP Apps repository

Build: #69 failed Changes by Ali Anwar

Stages & jobs

  1. Build Stage

Logs

The following logs have been generated by the jobs in this plan.
  • Expand all
  • Collapse all
Job Logs
Collapse MovieRecommender Build Stage Download or View
25-Aug-2017 20:05:22
25-Aug-2017 20:05:22 Results :
25-Aug-2017 20:05:22
25-Aug-2017 20:05:22 Tests in error:
25-Aug-2017 20:05:22   MovieRecommenderAppTest.testRecommendation:60->sendMovieData:106 » IllegalState
25-Aug-2017 20:05:22
25-Aug-2017 20:05:22 Tests run: 1, Failures: 0, Errors: 1, Skipped: 0
25-Aug-2017 20:05:22
25-Aug-2017 20:05:22 [INFO] ------------------------------------------------------------------------
25-Aug-2017 20:05:22 [INFO] BUILD FAILURE
25-Aug-2017 20:05:22 [INFO] ------------------------------------------------------------------------
25-Aug-2017 20:05:22 [INFO] Total time: 1:12.979s
25-Aug-2017 20:05:22 [INFO] Finished at: Fri Aug 25 20:05:22 UTC 2017
25-Aug-2017 20:05:22 [INFO] Final Memory: 86M/789M
25-Aug-2017 20:05:22 [INFO] ------------------------------------------------------------------------
25-Aug-2017 20:05:22 [ERROR] Failed to execute goal org.apache.maven.plugins:maven-surefire-plugin:2.14.1:test (default-test) on project MovieRecommender: There are test failures.
25-Aug-2017 20:05:22 [ERROR]
25-Aug-2017 20:05:22 [ERROR] Please refer to /var/bamboo/xml-data/build-dir/CA-BUT-MR/MovieRecommender/target/surefire-reports for the individual test results.
25-Aug-2017 20:05:22 [ERROR] -> [Help 1]
25-Aug-2017 20:05:22 [ERROR]
25-Aug-2017 20:05:22 [ERROR] To see the full stack trace of the errors, re-run Maven with the -e switch.
25-Aug-2017 20:05:22 [ERROR] Re-run Maven using the -X switch to enable full debug logging.
25-Aug-2017 20:05:22 [ERROR]
25-Aug-2017 20:05:22 [ERROR] For more information about the errors and possible solutions, please read the following articles:
25-Aug-2017 20:05:22 [ERROR] [Help 1] http://cwiki.apache.org/confluence/display/MAVEN/MojoFailureException
Collapse Netlens Build Stage Download or View
25-Aug-2017 20:40:59
25-Aug-2017 20:40:59 "VM Thread" prio=10 tid=0x00007f6688067800 nid=0x394f runnable
25-Aug-2017 20:40:59
25-Aug-2017 20:40:59 "GC task thread#0 (ParallelGC)" prio=10 tid=0x00007f668801d800 nid=0x394b runnable
25-Aug-2017 20:40:59
25-Aug-2017 20:40:59 "GC task thread#1 (ParallelGC)" prio=10 tid=0x00007f668801f800 nid=0x394c runnable
25-Aug-2017 20:40:59
25-Aug-2017 20:40:59 "GC task thread#2 (ParallelGC)" prio=10 tid=0x00007f6688021800 nid=0x394d runnable
25-Aug-2017 20:40:59
25-Aug-2017 20:40:59 "GC task thread#3 (ParallelGC)" prio=10 tid=0x00007f6688023000 nid=0x394e runnable
25-Aug-2017 20:40:59
25-Aug-2017 20:40:59 "VM Periodic Task Thread" prio=10 tid=0x00007f66880a1800 nid=0x3956 waiting on condition
25-Aug-2017 20:40:59
25-Aug-2017 20:40:59 JNI global references: 238
25-Aug-2017 20:40:59
25-Aug-2017 20:40:59 Heap
25-Aug-2017 20:40:59 PSYoungGen      total 134656K, used 75672K [0x00000007d5500000, 0x00000007e7c00000, 0x0000000800000000)
25-Aug-2017 20:40:59   eden space 112640K, 47% used [0x00000007d5500000,0x00000007d8967e80,0x00000007dc300000)
25-Aug-2017 20:40:59   from space 22016K, 99% used [0x00000007dc300000,0x00000007dd87e278,0x00000007dd880000)
25-Aug-2017 20:40:59   to   space 38400K, 0% used [0x00000007e5680000,0x00000007e5680000,0x00000007e7c00000)
25-Aug-2017 20:40:59 ParOldGen       total 159232K, used 46248K [0x0000000780000000, 0x0000000789b80000, 0x00000007d5500000)
25-Aug-2017 20:40:59   object space 159232K, 29% used [0x0000000780000000,0x0000000782d2a078,0x0000000789b80000)
25-Aug-2017 20:40:59 PSPermGen       total 24064K, used 23917K [0x000000077ae00000, 0x000000077c580000, 0x0000000780000000)
25-Aug-2017 20:40:59   object space 24064K, 99% used [0x000000077ae00000,0x000000077c55b720,0x000000077c580000)
25-Aug-2017 20:40:59
Collapse TwitterSentiment Build Stage Download or View
25-Aug-2017 20:15:58         at sun.reflect.NativeMethodAccessorImpl.invoke0(Native Method)
25-Aug-2017 20:15:58         at sun.reflect.NativeMethodAccessorImpl.invoke(NativeMethodAccessorImpl.java:57)
25-Aug-2017 20:15:58         at sun.reflect.DelegatingMethodAccessorImpl.invoke(DelegatingMethodAccessorImpl.java:43)
25-Aug-2017 20:15:58         at java.lang.reflect.Method.invoke(Method.java:606)
25-Aug-2017 20:15:58         at org.apache.maven.surefire.util.ReflectionUtils.invokeMethodWithArray(ReflectionUtils.java:189)
25-Aug-2017 20:15:58         at org.apache.maven.surefire.booter.ProviderFactory$ProviderProxy.invoke(ProviderFactory.java:165)
25-Aug-2017 20:15:58         at org.apache.maven.surefire.booter.ProviderFactory.invokeProvider(ProviderFactory.java:85)
25-Aug-2017 20:15:58         at org.apache.maven.surefire.booter.ForkedBooter.runSuitesInProcess(ForkedBooter.java:115)
25-Aug-2017 20:15:58         at org.apache.maven.surefire.booter.ForkedBooter.main(ForkedBooter.java:75)
25-Aug-2017 20:15:58 "VM Thread" prio=10 tid=0x00007f411812f000 nid=0x23ae runnable
25-Aug-2017 20:15:58 "GC task thread#0 (ParallelGC)" prio=10 tid=0x00007f411801d800 nid=0x23aa runnable
25-Aug-2017 20:15:58 "GC task thread#1 (ParallelGC)" prio=10 tid=0x00007f411801f800 nid=0x23ab runnable
25-Aug-2017 20:15:58 "GC task thread#2 (ParallelGC)" prio=10 tid=0x00007f4118021800 nid=0x23ac runnable
25-Aug-2017 20:15:58 "GC task thread#3 (ParallelGC)" prio=10 tid=0x00007f4118023000 nid=0x23ad runnable
25-Aug-2017 20:15:58 "VM Periodic Task Thread" prio=10 tid=0x00007f4118170800 nid=0x23b5 waiting on condition
25-Aug-2017 20:15:58 JNI global references: 270
25-Aug-2017 20:15:58 Heap
25-Aug-2017 20:15:58 PSYoungGen      total 1219584K, used 223705K [0x00000007b2280000, 0x0000000800000000, 0x0000000800000000)
25-Aug-2017 20:15:58   eden space 1163264K, 19% used [0x00000007b2280000,0x00000007bfcf6678,0x00000007f9280000)
25-Aug-2017 20:15:58   from space 56320K, 0% used [0x00000007fc900000,0x00000007fc900000,0x0000000800000000)
25-Aug-2017 20:15:58   to   space 55808K, 0% used [0x00000007f9280000,0x00000007f9280000,0x00000007fc900000)
25-Aug-2017 20:15:58 ParOldGen       total 124416K, used 37650K [0x0000000716800000, 0x000000071e180000, 0x00000007b2280000)
25-Aug-2017 20:15:58   object space 124416K, 30% used [0x0000000716800000,0x0000000718cc4b28,0x000000071e180000)
25-Aug-2017 20:15:58 PSPermGen       total 83968K, used 82943K [0x0000000711600000, 0x0000000716800000, 0x0000000716800000)
25-Aug-2017 20:15:58   object space 83968K, 98% used [0x0000000711600000,0x00000007166ffd08,0x0000000716800000)
Collapse Wise Build Stage Download or View
25-Aug-2017 20:06:23
25-Aug-2017 20:06:23 Results :
25-Aug-2017 20:06:23
25-Aug-2017 20:06:23 Failed tests:
25-Aug-2017 20:06:23   WiseAppTest.test:68 expected:<PageBounce{uri=/product.html, totalVisits=3, bounces=2}> but was:<PageBounce{uri=/product.html, totalVisits=0, bounces=0}>
25-Aug-2017 20:06:23
25-Aug-2017 20:06:23 Tests run: 1, Failures: 1, Errors: 0, Skipped: 0
25-Aug-2017 20:06:23
25-Aug-2017 20:06:23 [INFO] ------------------------------------------------------------------------
25-Aug-2017 20:06:23 [INFO] BUILD FAILURE
25-Aug-2017 20:06:23 [INFO] ------------------------------------------------------------------------
25-Aug-2017 20:06:23 [INFO] Total time: 2:14.309s
25-Aug-2017 20:06:23 [INFO] Finished at: Fri Aug 25 20:06:23 UTC 2017
25-Aug-2017 20:06:23 [INFO] Final Memory: 78M/819M
25-Aug-2017 20:06:23 [INFO] ------------------------------------------------------------------------
25-Aug-2017 20:06:23 [ERROR] Failed to execute goal org.apache.maven.plugins:maven-surefire-plugin:2.14.1:test (default-test) on project cdap-wise: There are test failures.
25-Aug-2017 20:06:23 [ERROR]
25-Aug-2017 20:06:23 [ERROR] Please refer to /var/bamboo/xml-data/build-dir/CA-BUT-WISE/Wise/target/surefire-reports for the individual test results.
25-Aug-2017 20:06:23 [ERROR] -> [Help 1]
25-Aug-2017 20:06:23 [ERROR]
25-Aug-2017 20:06:23 [ERROR] To see the full stack trace of the errors, re-run Maven with the -e switch.
25-Aug-2017 20:06:23 [ERROR] Re-run Maven using the -X switch to enable full debug logging.
25-Aug-2017 20:06:23 [ERROR]
25-Aug-2017 20:06:23 [ERROR] For more information about the errors and possible solutions, please read the following articles:
25-Aug-2017 20:06:23 [ERROR] [Help 1] http://cwiki.apache.org/confluence/display/MAVEN/MojoFailureException